{"text_format":"1","workbook":"xlsx","n_sheets":9,"sheets":["データ貼付","種目毎","抽出","Sheet2","Sheet3","Sheet4","Sheet5","Sheet6","Sheet1"],"not_rendered":{"charts":0,"images":0,"macros":1,"external_links":0,"defined_names":5,"comments":0,"pivot_tables":0},"unopened":[],"bounds":{"document_bytes":16777216,"sheet_cells":100000,"rows_first":2000,"rows_last":500,"rows_between":2000,"halvings":0,"cell_chars":16384,"cell_head_chars":4096},"cells_cut":0,"cells_raw":0,"read":"whole","date_system":"1900"}

{"sheet":"データ貼付","index":0,"n_rows":19151,"n_cols":15,"rows_kept":19151,"cut":false,"hidden":true,"merged":[]}
["競技会名","競技場","競技実施月日","クラス","種目","選手／チーム","記録","ラウンド","所属","学年","風速"]
["記録会４戦","北見","2019-08-04","中学男子","棒高跳","ｽﾉｰｼﾞｮｻｲﾔ",220,"決","網走第四中",1,null,null,{"$f":"F2&E2","v":"ｽﾉｰｼﾞｮｻｲﾔ棒高跳"},null,1]
["記録会４戦","北見","2019-08-04","中学女子","走高跳","阿部愛佳",130,"決","網走第三中",2,null,null,"阿部愛佳走高跳",null,{"$f":"IF(M3=M2,0,1)","v":1}]
["小学生ｵﾎｰﾂｸ","北見","2019-06-16","小学男子","走高跳","阿部空晴",120,"決","美幌RC",6,null,null,"阿部空晴走高跳",null,{"$f":"IF(M4=M3,0,1)","v":1}]
["小学生ｵﾎｰﾂｸ","北見","2019-06-16","小学男子","走高跳","安井徠人",105,"決","美幌RC",5,null,null,"安井徠人走高跳",null,1]
["全道高校","帯広"," 6/19","高校男子","棒高跳","安田留伊",400,"決","北見緑陵高",2,null,null,"安田留伊棒高跳",null,{"$f":"IF(M6=#REF!,0,1)","v":{"$error":"#REF!"}}]
["選手権","北見","2019-05-12","高校男子","走高跳","鞍元宏樹",140,"決","北見工業高",3,null,null,"鞍元宏樹走高跳",null,{"$f":"IF(M7=#REF!,0,1)","v":{"$error":"#REF!"}}]
["小学生記録会","北見","2019-09-28","小学男子","走高跳","伊藤尊",95,"決","ｵﾎｰﾂｸACｼﾞｭﾆｱ",4,null,null,"伊藤尊走高跳",null,1]
["通信陸上","網走","2019-06-29","中学女子","走高跳","伊藤来美",143,"決","北見南中",3,null,null,"伊藤来美走高跳",null,1]
["地区中体連","北見","2019-06-15","中学女子","走高跳","伊藤凛音",140,"決","北見南中",1,null,null,"伊藤凛音走高跳",null,1]
["記録会第２戦","網走","2019-05-04","高校男子","走高跳","伊奈翔大",160,"決","北見柏陽高",1,null,null,"伊奈翔大走高跳",null,{"$f":"IF(M11=#REF!,0,1)","v":{"$error":"#REF!"}}]
["小学生記録会","北見","2019-09-28","小学女子","走高跳","井上茜深",125,"決","常呂陸上少年団",6,null,null,"井上茜深走高跳",null,1]
["記録会４戦","北見","2019-08-04","中学女子","走高跳","井上優奈",125,"決","置戸中",3,null,null,"井上優奈走高跳",null,{"$f":"IF(M13=#REF!,0,1)","v":{"$error":"#REF!"}}]
["秋季陸上","網走","2019-09-08","中学女子","走高跳","井尾愛美",130,"決","網走第一中",2,null,null,"井尾愛美走高跳",null,1]
["地区中体連","北見","2019-06-15","中学女子","走高跳","一谷美穂",125,"決","紋別中",3,null,null,"一谷美穂走高跳",null,1]
{"$rows_left_out":19137}
{"sheet":"種目毎","index":1,"n_rows":53,"n_cols":36,"rows_kept":53,"cut":false,"hidden":false,"merged":[[33,8,33,9],[34,8,34,9],[35,8,35,9],[36,8,36,9],[24,8,24,9],[25,8,25,9],[26,8,26,9],[27,8,27,9],[28,8,28,9],[29,8,29,9],[30,8,30,9],[31,8,31,9],[32,8,32,9],[15,8,15,9],[16,8,16,9],[17,8,17,9],[18,8,18,9],[19,8,19,9],[20,8,20,9],[21,8,21,9],[22,8,22,9],[23,8,23,9],[7,8,7,9],[8,8,8,9],[9,8,9,9],[10,8,10,9],[11,8,11,9],[46,6,46,7],[41,3,41,5],[41,6,41,7],[42,3,42,5],[42,6,42,7],[43,3,43,5],[43,6,43,7],[33,3,33,5],[33,6,33,7],[34,3,34,5],[34,6,34,7],[35,3,35,5],[35,6,35,7],[36,3,36,5],[36,6,36,7],[37,3,37,5],[37,6,37,7],[45,8,45,9],[14,8,14,9],[40,3,40,5],[40,6,40,7],[44,3,44,5],[44,6,44,7],[45,3,45,5],[45,6,45,7],[46,3,46,5],[37,8,37,9],[38,8,38,9],[39,8,39,9],[40,8,40,9],[41,8,41,9],[42,8,42,9],[43,8,43,9],[44,8,44,9],[22,6,22,7],[50,8,50,9],[51,3,51,5],[51,6,51,7],[52,3,52,5],[52,6,52,7],[47,3,47,5],[47,6,47,7],[48,3,48,5],[48,6,48,7],[49,3,49,5],[49,6,49,7],[50,3,50,5],[50,6,50,7],[47,8,47,9],[48,8,48,9],[49,8,49,9],[51,8,51,9],[52,8,52,9],[46,8,46,9],[38,3,38,5],[38,6,38,7],[39,3,39,5],[39,6,39,7],[17,3,17,5],[17,6,17,7],[18,3,18,5],[18,6,18,7],[19,3,19,5],[19,6,19,7],[32,3,32,5],[32,6,32,7],[26,3,26,5],[26,6,26,7],[27,3,27,5],[27,6,27,7],[28,3,28,5],[28,6,28,7],[25,3,25,5],[25,6,25,7],[29,3,29,5],[29,6,29,7],[30,3,30,5],[30,6,30,7],[31,3,31,5],[31,6,31,7],[23,3,23,5],[23,6,23,7],[15,3,15,5],[15,6,15,7],[16,3,16,5],[16,6,16,7],[12,3,12,5],[12,6,12,7],[13,3,13,5],[13,6,13,7],[4,3,4,5],[4,6,4,7],[5,3,5,5],[5,6,5,7],[6,3,6,5],[6,6,6,7],[7,3,7,5],[7,6,7,7],[8,3,8,5],[8,6,8,7],[14,3,14,5],[14,6,14,7],[11,6,11,7],[11,3,11,5],[52,18,52,20],[47,18,47,20],[48,18,48,20],[49,18,49,20],[50,18,50,20],[51,18,51,20],[42,18,42,20],[43,18,43,20],[44,18,44,20],[45,18,45,20],[46,18,46,20],[37,18,37,20],[38,18,38,20],[39,18,39,20],[40,18,40,20],[41,18,41,20],[32,18,32,20],[33,18,33,20],[34,18,34,20],[35,18,35,20],[36,18,36,20],[13,18,13,20],[14,18,14,20],[15,18,15,20],[16,18,16,20],[27,18,27,20],[28,18,28,20],[29,18,29,20],[30,18,30,20],[31,18,31,20],[22,18,22,20],[23,18,23,20],[24,18,24,20],[25,18,25,20],[26,18,26,20],[4,18,4,20],[5,18,5,20],[6,18,6,20],[7,18,7,20],[8,18,8,20],[9,18,9,20],[10,18,10,20],[11,18,11,20],[12,18,12,20],[27,14,27,16],[28,14,28,16],[29,14,29,16],[17,18,17,20],[18,18,18,20],[19,18,19,20],[20,18,20,20],[21,18,21,20],[17,14,17,16],[18,14,18,16],[19,14,19,16],[14,14,14,16],[5,14,5,16],[6,14,6,16],[7,14,7,16],[8,14,8,16],[9,14,9,16],[11,14,11,16],[50,14,50,16],[51,14,51,16],[40,14,40,16],[41,14,41,16],[42,14,42,16],[35,14,35,16],[36,14,36,16],[37,14,37,16],[38,14,38,16],[39,14,39,16],[30,14,30,16],[31,14,31,16],[32,14,32,16],[33,14,33,16],[34,14,34,16],[25,14,25,16],[26,14,26,16],[52,14,52,16],[48,10,48,13],[49,10,49,13],[50,10,50,13],[51,10,51,13],[52,10,52,13],[43,10,43,13],[44,10,44,13],[45,10,45,13],[46,10,46,13],[47,10,47,13],[45,14,45,16],[46,14,46,16],[47,14,47,16],[48,14,48,16],[49,14,49,16],[43,14,43,16],[44,14,44,16],[38,10,38,13],[39,10,39,13],[40,10,40,13],[41,10,41,13],[42,10,42,13],[0,20,0,22],[0,18,0,19],[0,13,0,14],[0,15,0,17],[2,10,2,13],[2,14,2,16],[2,18,2,20],[33,10,33,13],[34,10,34,13],[35,10,35,13],[36,10,36,13],[37,10,37,13],[28,10,28,13],[29,10,29,13],[30,10,30,13],[31,10,31,13],[32,10,32,13],[23,10,23,13],[24,10,24,13],[25,10,25,13],[26,10,26,13],[27,10,27,13],[18,10,18,13],[19,10,19,13],[20,10,20,13],[21,10,21,13],[22,10,22,13],[15,10,15,13],[16,10,16,13],[17,10,17,13],[2,8,2,9],[3,18,3,20],[4,14,4,16],[10,14,10,16],[24,3,24,5],[24,6,24,7],[20,3,20,5],[20,6,20,7],[21,3,21,5],[21,6,21,7],[22,3,22,5],[14,10,14,13],[8,10,8,13],[9,10,9,13],[10,10,10,13],[11,10,11,13],[12,10,12,13],[20,14,20,16],[21,14,21,16],[22,14,22,16],[23,14,23,16],[24,14,24,16],[15,14,15,16],[16,14,16,16],[2,6,2,7],[2,3,2,5],[0,0,0,12],[13,10,13,13],[3,3,3,5],[3,6,3,7],[3,14,3,16],[12,14,12,16],[13,14,13,16],[9,3,9,5],[9,6,9,7],[10,3,10,5],[10,6,10,7],[12,8,12,9],[13,8,13,9],[3,8,3,9],[4,8,4,9],[5,8,5,9],[6,8,6,9],[3,10,3,13],[4,10,4,13],[5,10,5,13],[6,10,6,13],[7,10,7,13]]}
["R01　オホーツク陸協　記録集計",null,null,null,null,null,null,null,null,null,null,null,null,"種別",null,"中学男子",null,null,"種目",null,"棒高跳",null,null,null,null,"競技会名","競技場","競技実施月日","クラス","種目","選手／チーム","記録","ラウンド","所属","学年","風速"]
[]
["全順",null,"Rank","競技会名",null,null,"競技場",null,"実施日",null,"選手",null,null,null,"記録",null,null,"R","所属",null,null,"年","風"]
[1,{"$f":"IF(COUNTIF($K$4:N4,K4)=1,1,0)","v":1},1,{"$f":"VLOOKUP($P$1&$U$1&A4,抽出!$B$4:$O$200,6,FALSE)","v":"記録会４戦"},null,null,{"$f":"VLOOKUP($P$1&$U$1&A4,抽出!$B$4:$O$200,7,FALSE)","v":"北見"},null,{"$f":"VLOOKUP($P$1&$U$1&A4,抽出!$B$4:$O$200,8,FALSE)","v":"2019-08-04"},null,{"$f":"VLOOKUP($P$1&$U$1&A4,抽出!$B$4:$O$200,9,FALSE)","v":"栗生朔門"},null,null,null,{"$f":"VLOOKUP($P$1&$U$1&A4,抽出!$B$4:$O$200,10,FALSE)","v":410},null,null,{"$f":"VLOOKUP($P$1&$U$1&A4,抽出!$B$4:$O$200,11,FALSE)","v":"決"},{"$f":"VLOOKUP($P$1&$U$1&A4,抽出!$B$4:$O$200,12,FALSE)","v":"網走第四中"},null,null,{"$f":"VLOOKUP($P$1&$U$1&A4,抽出!$B$4:$O$200,13,FALSE)","v":3},{"$f":"VLOOKUP($P$1&$U$1&A4,抽出!$B$4:$O$200,14,FALSE)","v":0},null,null,"小学男子","小男"]
[2,{"$f":"IF(COUNTIF($K$4:N5,K5)=1,1,0)","v":1},{"$f":"IF(B5=0,\"\",SUM($B$4:B5))","v":2},{"$f":"VLOOKUP($P$1&$U$1&A5,抽出!$B$4:$O$200,6,FALSE)","v":"全道中学"},null,null,{"$f":"VLOOKUP($P$1&$U$1&A5,抽出!$B$4:$O$200,7,FALSE)","v":"旭川"},null,{"$f":"VLOOKUP($P$1&$U$1&A5,抽出!$B$4:$O$200,8,FALSE)","v":"2019-07-26"},null,{"$f":"VLOOKUP($P$1&$U$1&A5,抽出!$B$4:$O$200,9,FALSE)","v":"中田竜翔"},null,null,null,{"$f":"VLOOKUP($P$1&$U$1&A5,抽出!$B$4:$O$200,10,FALSE)","v":380},null,null,{"$f":"VLOOKUP($P$1&$U$1&A5,抽出!$B$4:$O$200,11,FALSE)","v":"予"},{"$f":"VLOOKUP($P$1&$U$1&A5,抽出!$B$4:$O$200,12,FALSE)","v":"網走第一中"},null,null,{"$f":"VLOOKUP($P$1&$U$1&A5,抽出!$B$4:$O$200,13,FALSE)","v":3},{"$f":"VLOOKUP($P$1&$U$1&A5,抽出!$B$4:$O$200,14,FALSE)","v":0},null,null,"小学女子","小女",null,"棒高跳"]
[3,{"$f":"IF(COUNTIF($K$4:N6,K6)=1,1,0)","v":1},{"$f":"IF(B6=0,\"\",SUM($B$4:B6))","v":3},{"$f":"VLOOKUP($P$1&$U$1&A6,抽出!$B$4:$O$200,6,FALSE)","v":"秋季陸上"},null,null,{"$f":"VLOOKUP($P$1&$U$1&A6,抽出!$B$4:$O$200,7,FALSE)","v":"網走"},null,{"$f":"VLOOKUP($P$1&$U$1&A6,抽出!$B$4:$O$200,8,FALSE)","v":"2019-09-07"},null,{"$f":"VLOOKUP($P$1&$U$1&A6,抽出!$B$4:$O$200,9,FALSE)","v":"石田和也"},null,null,null,{"$f":"VLOOKUP($P$1&$U$1&A6,抽出!$B$4:$O$200,10,FALSE)","v":371},null,null,{"$f":"VLOOKUP($P$1&$U$1&A6,抽出!$B$4:$O$200,11,FALSE)","v":"決"},{"$f":"VLOOKUP($P$1&$U$1&A6,抽出!$B$4:$O$200,12,FALSE)","v":"網走第一中"},null,null,{"$f":"VLOOKUP($P$1&$U$1&A6,抽出!$B$4:$O$200,13,FALSE)","v":3},{"$f":"VLOOKUP($P$1&$U$1&A6,抽出!$B$4:$O$200,14,FALSE)","v":0},null,null,"中学男子","中男",null,"走高跳"]
[4,{"$f":"IF(COUNTIF($K$4:N7,K7)=1,1,0)","v":1},{"$f":"IF(B7=0,\"\",SUM($B$4:B7))","v":4},{"$f":"VLOOKUP($P$1&$U$1&A7,抽出!$B$4:$O$200,6,FALSE)","v":"秋季陸上"},null,null,{"$f":"VLOOKUP($P$1&$U$1&A7,抽出!$B$4:$O$200,7,FALSE)","v":"網走"},null,{"$f":"VLOOKUP($P$1&$U$1&A7,抽出!$B$4:$O$200,8,FALSE)","v":"2019-09-07"},null,{"$f":"VLOOKUP($P$1&$U$1&A7,抽出!$B$4:$O$200,9,FALSE)","v":"佐野巧"},null,null,null,{"$f":"VLOOKUP($P$1&$U$1&A7,抽出!$B$4:$O$200,10,FALSE)","v":350},null,null,{"$f":"VLOOKUP($P$1&$U$1&A7,抽出!$B$4:$O$200,11,FALSE)","v":"決"},{"$f":"VLOOKUP($P$1&$U$1&A7,抽出!$B$4:$O$200,12,FALSE)","v":"斜里中"},null,null,{"$f":"VLOOKUP($P$1&$U$1&A7,抽出!$B$4:$O$200,13,FALSE)","v":3},{"$f":"VLOOKUP($P$1&$U$1&A7,抽出!$B$4:$O$200,14,FALSE)","v":0},null,null,"中学女子","中女"]
[5,{"$f":"IF(COUNTIF($K$4:N8,K8)=1,1,0)","v":1},{"$f":"IF(B8=0,\"\",SUM($B$4:B8))","v":5},{"$f":"VLOOKUP($P$1&$U$1&A8,抽出!$B$4:$O$200,6,FALSE)","v":"秋季陸上"},null,null,{"$f":"VLOOKUP($P$1&$U$1&A8,抽出!$B$4:$O$200,7,FALSE)","v":"網走"},null,{"$f":"VLOOKUP($P$1&$U$1&A8,抽出!$B$4:$O$200,8,FALSE)","v":"2019-09-07"},null,{"$f":"VLOOKUP($P$1&$U$1&A8,抽出!$B$4:$O$200,9,FALSE)","v":"川島歩結夢"},null,null,null,{"$f":"VLOOKUP($P$1&$U$1&A8,抽出!$B$4:$O$200,10,FALSE)","v":340},null,null,{"$f":"VLOOKUP($P$1&$U$1&A8,抽出!$B$4:$O$200,11,FALSE)","v":"決"},{"$f":"VLOOKUP($P$1&$U$1&A8,抽出!$B$4:$O$200,12,FALSE)","v":"斜里中"},null,null,{"$f":"VLOOKUP($P$1&$U$1&A8,抽出!$B$4:$O$200,13,FALSE)","v":2},{"$f":"VLOOKUP($P$1&$U$1&A8,抽出!$B$4:$O$200,14,FALSE)","v":0},null,null,"高校男子","高男"]
[6,{"$f":"IF(COUNTIF($K$4:N9,K9)=1,1,0)","v":1},{"$f":"IF(B9=0,\"\",SUM($B$4:B9))","v":6},{"$f":"VLOOKUP($P$1&$U$1&A9,抽出!$B$4:$O$200,6,FALSE)","v":"全道中学新人"},null,null,{"$f":"VLOOKUP($P$1&$U$1&A9,抽出!$B$4:$O$200,7,FALSE)","v":"千歳"},null,{"$f":"VLOOKUP($P$1&$U$1&A9,抽出!$B$4:$O$200,8,FALSE)","v":"2019-09-21"},null,{"$f":"VLOOKUP($P$1&$U$1&A9,抽出!$B$4:$O$200,9,FALSE)","v":"福田悠介"},null,null,null,{"$f":"VLOOKUP($P$1&$U$1&A9,抽出!$B$4:$O$200,10,FALSE)","v":320},null,null,{"$f":"VLOOKUP($P$1&$U$1&A9,抽出!$B$4:$O$200,11,FALSE)","v":"決"},{"$f":"VLOOKUP($P$1&$U$1&A9,抽出!$B$4:$O$200,12,FALSE)","v":"網走第一"},null,null,{"$f":"VLOOKUP($P$1&$U$1&A9,抽出!$B$4:$O$200,13,FALSE)","v":2},{"$f":"VLOOKUP($P$1&$U$1&A9,抽出!$B$4:$O$200,14,FALSE)","v":0},null,null,"高校女子","高女"]
[7,{"$f":"IF(COUNTIF($K$4:N10,K10)=1,1,0)","v":1},{"$f":"IF(B10=0,\"\",SUM($B$4:B10))","v":7},{"$f":"VLOOKUP($P$1&$U$1&A10,抽出!$B$4:$O$200,6,FALSE)","v":"フィールド記録会"},null,null,{"$f":"VLOOKUP($P$1&$U$1&A10,抽出!$B$4:$O$200,7,FALSE)","v":"網走"},null,{"$f":"VLOOKUP($P$1&$U$1&A10,抽出!$B$4:$O$200,8,FALSE)","v":"2019-06-08"},null,{"$f":"VLOOKUP($P$1&$U$1&A10,抽出!$B$4:$O$200,9,FALSE)","v":"市村宥樹"},null,null,null,{"$f":"VLOOKUP($P$1&$U$1&A10,抽出!$B$4:$O$200,10,FALSE)","v":280},null,null,{"$f":"VLOOKUP($P$1&$U$1&A10,抽出!$B$4:$O$200,11,FALSE)","v":"決"},{"$f":"VLOOKUP($P$1&$U$1&A10,抽出!$B$4:$O$200,12,FALSE)","v":"斜里中"},null,null,{"$f":"VLOOKUP($P$1&$U$1&A10,抽出!$B$4:$O$200,13,FALSE)","v":3},{"$f":"VLOOKUP($P$1&$U$1&A10,抽出!$B$4:$O$200,14,FALSE)","v":0},null,null,"一般男子","一男"]
[8,{"$f":"IF(COUNTIF($K$4:N11,K11)=1,1,0)","v":1},{"$f":"IF(B11=0,\"\",SUM($B$4:B11))","v":8},{"$f":"VLOOKUP($P$1&$U$1&A11,抽出!$B$4:$O$200,6,FALSE)","v":"全道中学新人"},null,null,{"$f":"VLOOKUP($P$1&$U$1&A11,抽出!$B$4:$O$200,7,FALSE)","v":"千歳"},null,{"$f":"VLOOKUP($P$1&$U$1&A11,抽出!$B$4:$O$200,8,FALSE)","v":"2019-09-21"},null,{"$f":"VLOOKUP($P$1&$U$1&A11,抽出!$B$4:$O$200,9,FALSE)","v":"川上大晴"},null,null,null,{"$f":"VLOOKUP($P$1&$U$1&A11,抽出!$B$4:$O$200,10,FALSE)","v":260},null,null,{"$f":"VLOOKUP($P$1&$U$1&A11,抽出!$B$4:$O$200,11,FALSE)","v":"決"},{"$f":"VLOOKUP($P$1&$U$1&A11,抽出!$B$4:$O$200,12,FALSE)","v":"北見小泉"},null,null,{"$f":"VLOOKUP($P$1&$U$1&A11,抽出!$B$4:$O$200,13,FALSE)","v":2},{"$f":"VLOOKUP($P$1&$U$1&A11,抽出!$B$4:$O$200,14,FALSE)","v":0},null,null,"一般女子","一女"]
[9,{"$f":"IF(COUNTIF($K$4:N12,K12)=1,1,0)","v":1},{"$f":"IF(B12=0,\"\",SUM($B$4:B12))","v":9},{"$f":"VLOOKUP($P$1&$U$1&A12,抽出!$B$4:$O$200,6,FALSE)","v":"秋季陸上"},null,null,{"$f":"VLOOKUP($P$1&$U$1&A12,抽出!$B$4:$O$200,7,FALSE)","v":"網走"},null,{"$f":"VLOOKUP($P$1&$U$1&A12,抽出!$B$4:$O$200,8,FALSE)","v":"2019-09-07"},null,{"$f":"VLOOKUP($P$1&$U$1&A12,抽出!$B$4:$O$200,9,FALSE)","v":"佐藤大斗"},null,null,null,{"$f":"VLOOKUP($P$1&$U$1&A12,抽出!$B$4:$O$200,10,FALSE)","v":240},null,null,{"$f":"VLOOKUP($P$1&$U$1&A12,抽出!$B$4:$O$200,11,FALSE)","v":"決"},{"$f":"VLOOKUP($P$1&$U$1&A12,抽出!$B$4:$O$200,12,FALSE)","v":"斜里中"},null,null,{"$f":"VLOOKUP($P$1&$U$1&A12,抽出!$B$4:$O$200,13,FALSE)","v":1},{"$f":"VLOOKUP($P$1&$U$1&A12,抽出!$B$4:$O$200,14,FALSE)","v":0}]
[10,{"$f":"IF(COUNTIF($K$4:N13,K13)=1,1,0)","v":1},{"$f":"IF(B13=0,\"\",SUM($B$4:B13))","v":10},{"$f":"VLOOKUP($P$1&$U$1&A13,抽出!$B$4:$O$200,6,FALSE)","v":"地区中体連"},null,null,{"$f":"VLOOKUP($P$1&$U$1&A13,抽出!$B$4:$O$200,7,FALSE)","v":"北見"},null,{"$f":"VLOOKUP($P$1&$U$1&A13,抽出!$B$4:$O$200,8,FALSE)","v":"2019-06-14"},null,{"$f":"VLOOKUP($P$1&$U$1&A13,抽出!$B$4:$O$200,9,FALSE)","v":"古畑愛斗"},null,null,null,{"$f":"VLOOKUP($P$1&$U$1&A13,抽出!$B$4:$O$200,10,FALSE)","v":240},null,null,{"$f":"VLOOKUP($P$1&$U$1&A13,抽出!$B$4:$O$200,11,FALSE)","v":"決"},{"$f":"VLOOKUP($P$1&$U$1&A13,抽出!$B$4:$O$200,12,FALSE)","v":"北見小泉中"},null,null,{"$f":"VLOOKUP($P$1&$U$1&A13,抽出!$B$4:$O$200,13,FALSE)","v":2},{"$f":"VLOOKUP($P$1&$U$1&A13,抽出!$B$4:$O$200,14,FALSE)","v":0}]
[11,{"$f":"IF(COUNTIF($K$4:N14,K14)=1,1,0)","v":1},{"$f":"IF(B14=0,\"\",SUM($B$4:B14))","v":11},{"$f":"VLOOKUP($P$1&$U$1&A14,抽出!$B$4:$O$200,6,FALSE)","v":"地区中体連"},null,null,{"$f":"VLOOKUP($P$1&$U$1&A14,抽出!$B$4:$O$200,7,FALSE)","v":"北見"},null,{"$f":"VLOOKUP($P$1&$U$1&A14,抽出!$B$4:$O$200,8,FALSE)","v":"2019-06-14"},null,{"$f":"VLOOKUP($P$1&$U$1&A14,抽出!$B$4:$O$200,9,FALSE)","v":"山本銀士郎"},null,null,null,{"$f":"VLOOKUP($P$1&$U$1&A14,抽出!$B$4:$O$200,10,FALSE)","v":230},null,null,{"$f":"VLOOKUP($P$1&$U$1&A14,抽出!$B$4:$O$200,11,FALSE)","v":"決"},{"$f":"VLOOKUP($P$1&$U$1&A14,抽出!$B$4:$O$200,12,FALSE)","v":"網走第一中"},null,null,{"$f":"VLOOKUP($P$1&$U$1&A14,抽出!$B$4:$O$200,13,FALSE)","v":2},{"$f":"VLOOKUP($P$1&$U$1&A14,抽出!$B$4:$O$200,14,FALSE)","v":0}]
[12,{"$f":"IF(COUNTIF($K$4:N15,K15)=1,1,0)","v":1},{"$f":"IF(B15=0,\"\",SUM($B$4:B15))","v":12},{"$f":"VLOOKUP($P$1&$U$1&A15,抽出!$B$4:$O$200,6,FALSE)","v":"記録会４戦"},null,null,{"$f":"VLOOKUP($P$1&$U$1&A15,抽出!$B$4:$O$200,7,FALSE)","v":"北見"},null,{"$f":"VLOOKUP($P$1&$U$1&A15,抽出!$B$4:$O$200,8,FALSE)","v":"2019-08-04"},null,{"$f":"VLOOKUP($P$1&$U$1&A15,抽出!$B$4:$O$200,9,FALSE)","v":"ｽﾉｰｼﾞｮｻｲﾔ"},null,null,null,{"$f":"VLOOKUP($P$1&$U$1&A15,抽出!$B$4:$O$200,10,FALSE)","v":220},null,null,{"$f":"VLOOKUP($P$1&$U$1&A15,抽出!$B$4:$O$200,11,FALSE)","v":"決"},{"$f":"VLOOKUP($P$1&$U$1&A15,抽出!$B$4:$O$200,12,FALSE)","v":"網走第四中"},null,null,{"$f":"VLOOKUP($P$1&$U$1&A15,抽出!$B$4:$O$200,13,FALSE)","v":1},{"$f":"VLOOKUP($P$1&$U$1&A15,抽出!$B$4:$O$200,14,FALSE)","v":0}]
{"$rows_left_out":39}
{"sheet":"抽出","index":2,"n_rows":305,"n_cols":60,"rows_kept":305,"cut":false,"hidden":true,"merged":[]}
[]
[null,1,2,3,4,5,6,7,8,9,10,11,12,13,14]
[null,"クラス＋種目名＋種目内順位",null,"クラス＋種目名","記録＋行番号","種目内順位","競技会名","競技場","実施日","選手名","記録","R","所属","学年","風"]
[1,{"$f":"D4&F4","v":"中学男子棒高跳12"},{"$f":"J4&COUNTIF($J$4:J4,J4)","v":"ｽﾉｰｼﾞｮｻｲﾔ1"},{"$f":"データ貼付!D2&データ貼付!E2","v":"中学男子棒高跳"},{"$f":"データ貼付!G2+ROW()/1000000","v":220.00000399999999},{"$f":"SUMPRODUCT(($D$4:$D$200=D4)*($E$4:$E$200>E4))+1","v":12},{"$f":"データ貼付!A2","v":"記録会４戦"},{"$f":"データ貼付!B2","v":"北見"},{"$f":"データ貼付!C2","v":43681},{"$f":"データ貼付!F2","v":"ｽﾉｰｼﾞｮｻｲﾔ"},{"$f":"データ貼付!G2","v":220},{"$f":"データ貼付!H2","v":"決"},{"$f":"データ貼付!I2","v":"網走第四中"},{"$f":"データ貼付!J2","v":1},{"$f":"データ貼付!K2","v":0}]
[2,{"$f":"D5&F5","v":"中学女子走高跳15"},{"$f":"J5&COUNTIF($J$4:J5,J5)","v":"阿部愛佳1"},{"$f":"データ貼付!D3&データ貼付!E3","v":"中学女子走高跳"},{"$f":"データ貼付!G3+ROW()/1000000","v":130.00000499999999},{"$f":"SUMPRODUCT(($D$4:$D$200=D5)*($E$4:$E$200>E5))+1","v":15},{"$f":"データ貼付!A3","v":"記録会４戦"},{"$f":"データ貼付!B3","v":"北見"},{"$f":"データ貼付!C3","v":43681},{"$f":"データ貼付!F3","v":"阿部愛佳"},{"$f":"データ貼付!G3","v":130},{"$f":"データ貼付!H3","v":"決"},{"$f":"データ貼付!I3","v":"網走第三中"},{"$f":"データ貼付!J3","v":2},{"$f":"データ貼付!K3","v":0}]
[3,"小学男子走高跳6",{"$f":"J6&COUNTIF($J$4:J6,J6)","v":"阿部空晴1"},{"$f":"データ貼付!D4&データ貼付!E4","v":"小学男子走高跳"},{"$f":"データ貼付!G4+ROW()/1000000","v":120.000006},6,{"$f":"データ貼付!A4","v":"小学生ｵﾎｰﾂｸ"},{"$f":"データ貼付!B4","v":"北見"},{"$f":"データ貼付!C4","v":43632},{"$f":"データ貼付!F4","v":"阿部空晴"},{"$f":"データ貼付!G4","v":120},{"$f":"データ貼付!H4","v":"決"},{"$f":"データ貼付!I4","v":"美幌RC"},{"$f":"データ貼付!J4","v":6},{"$f":"データ貼付!K4","v":0}]
[4,"小学男子走高跳20",{"$f":"J7&COUNTIF($J$4:J7,J7)","v":"安井徠人1"},{"$f":"データ貼付!D5&データ貼付!E5","v":"小学男子走高跳"},{"$f":"データ貼付!G5+ROW()/1000000","v":105.000007},20,{"$f":"データ貼付!A5","v":"小学生ｵﾎｰﾂｸ"},{"$f":"データ貼付!B5","v":"北見"},{"$f":"データ貼付!C5","v":43632},{"$f":"データ貼付!F5","v":"安井徠人"},{"$f":"データ貼付!G5","v":105},{"$f":"データ貼付!H5","v":"決"},{"$f":"データ貼付!I5","v":"美幌RC"},{"$f":"データ貼付!J5","v":5},{"$f":"データ貼付!K5","v":0}]
[5,"高校男子棒高跳5",{"$f":"J8&COUNTIF($J$4:J8,J8)","v":"安田留伊1"},{"$f":"データ貼付!D6&データ貼付!E6","v":"高校男子棒高跳"},{"$f":"データ貼付!G6+ROW()/1000000","v":400.00000799999998},5,{"$f":"データ貼付!A6","v":"全道高校"},{"$f":"データ貼付!B6","v":"帯広"},{"$f":"データ貼付!C6","v":" 6/19"},{"$f":"データ貼付!F6","v":"安田留伊"},{"$f":"データ貼付!G6","v":400},{"$f":"データ貼付!H6","v":"決"},{"$f":"データ貼付!I6","v":"北見緑陵高"},{"$f":"データ貼付!J6","v":2},{"$f":"データ貼付!K6","v":0}]
[6,"高校男子走高跳24",{"$f":"J9&COUNTIF($J$4:J9,J9)","v":"鞍元宏樹1"},{"$f":"データ貼付!D7&データ貼付!E7","v":"高校男子走高跳"},{"$f":"データ貼付!G7+ROW()/1000000","v":140.00000900000001},24,{"$f":"データ貼付!A7","v":"選手権"},{"$f":"データ貼付!B7","v":"北見"},{"$f":"データ貼付!C7","v":43597},{"$f":"データ貼付!F7","v":"鞍元宏樹"},{"$f":"データ貼付!G7","v":140},{"$f":"データ貼付!H7","v":"決"},{"$f":"データ貼付!I7","v":"北見工業高"},{"$f":"データ貼付!J7","v":3},{"$f":"データ貼付!K7","v":0}]
[7,"小学男子走高跳22",{"$f":"J10&COUNTIF($J$4:J10,J10)","v":"伊藤尊1"},{"$f":"データ貼付!D8&データ貼付!E8","v":"小学男子走高跳"},{"$f":"データ貼付!G8+ROW()/1000000","v":95.000010000000003},22,{"$f":"データ貼付!A8","v":"小学生記録会"},{"$f":"データ貼付!B8","v":"北見"},{"$f":"データ貼付!C8","v":43736},{"$f":"データ貼付!F8","v":"伊藤尊"},{"$f":"データ貼付!G8","v":95},{"$f":"データ貼付!H8","v":"決"},{"$f":"データ貼付!I8","v":"ｵﾎｰﾂｸACｼﾞｭﾆｱ"},{"$f":"データ貼付!J8","v":4},{"$f":"データ貼付!K8","v":0}]
[8,"中学女子走高跳3",{"$f":"J11&COUNTIF($J$4:J11,J11)","v":"伊藤来美1"},{"$f":"データ貼付!D9&データ貼付!E9","v":"中学女子走高跳"},{"$f":"データ貼付!G9+ROW()/1000000","v":143.000011},3,{"$f":"データ貼付!A9","v":"通信陸上"},{"$f":"データ貼付!B9","v":"網走"},{"$f":"データ貼付!C9","v":43645},{"$f":"データ貼付!F9","v":"伊藤来美"},{"$f":"データ貼付!G9","v":143},{"$f":"データ貼付!H9","v":"決"},{"$f":"データ貼付!I9","v":"北見南中"},{"$f":"データ貼付!J9","v":3},{"$f":"データ貼付!K9","v":0}]
[9,"中学女子走高跳5",{"$f":"J12&COUNTIF($J$4:J12,J12)","v":"伊藤凛音1"},{"$f":"データ貼付!D10&データ貼付!E10","v":"中学女子走高跳"},{"$f":"データ貼付!G10+ROW()/1000000","v":140.000012},5,{"$f":"データ貼付!A10","v":"地区中体連"},{"$f":"データ貼付!B10","v":"北見"},{"$f":"データ貼付!C10","v":43631},{"$f":"データ貼付!F10","v":"伊藤凛音"},{"$f":"データ貼付!G10","v":140},{"$f":"データ貼付!H10","v":"決"},{"$f":"データ貼付!I10","v":"北見南中"},{"$f":"データ貼付!J10","v":1},{"$f":"データ貼付!K10","v":0}]
[10,"高校男子走高跳16",{"$f":"J13&COUNTIF($J$4:J13,J13)","v":"伊奈翔大1"},{"$f":"データ貼付!D11&データ貼付!E11","v":"高校男子走高跳"},{"$f":"データ貼付!G11+ROW()/1000000","v":160.000013},16,{"$f":"データ貼付!A11","v":"記録会第２戦"},{"$f":"データ貼付!B11","v":"網走"},{"$f":"データ貼付!C11","v":43589},{"$f":"データ貼付!F11","v":"伊奈翔大"},{"$f":"データ貼付!G11","v":160},{"$f":"データ貼付!H11","v":"決"},{"$f":"データ貼付!I11","v":"北見柏陽高"},{"$f":"データ貼付!J11","v":1},{"$f":"データ貼付!K11","v":0}]
[11,"小学女子走高跳1",{"$f":"J14&COUNTIF($J$4:J14,J14)","v":"井上茜深1"},{"$f":"データ貼付!D12&データ貼付!E12","v":"小学女子走高跳"},{"$f":"データ貼付!G12+ROW()/1000000","v":125.00001399999999},1,{"$f":"データ貼付!A12","v":"小学生記録会"},{"$f":"データ貼付!B12","v":"北見"},{"$f":"データ貼付!C12","v":43736},{"$f":"データ貼付!F12","v":"井上茜深"},{"$f":"データ貼付!G12","v":125},{"$f":"データ貼付!H12","v":"決"},{"$f":"データ貼付!I12","v":"常呂陸上少年団"},{"$f":"データ貼付!J12","v":6},{"$f":"データ貼付!K12","v":0}]
[12,"中学女子走高跳18",{"$f":"J15&COUNTIF($J$4:J15,J15)","v":"井上優奈1"},{"$f":"データ貼付!D13&データ貼付!E13","v":"中学女子走高跳"},{"$f":"データ貼付!G13+ROW()/1000000","v":125.000015},18,{"$f":"データ貼付!A13","v":"記録会４戦"},{"$f":"データ貼付!B13","v":"北見"},{"$f":"データ貼付!C13","v":43681},{"$f":"データ貼付!F13","v":"井上優奈"},{"$f":"データ貼付!G13","v":125},{"$f":"データ貼付!H13","v":"決"},{"$f":"データ貼付!I13","v":"置戸中"},{"$f":"データ貼付!J13","v":3},{"$f":"データ貼付!K13","v":0}]
{"$rows_left_out":291}
{"sheet":"Sheet2","index":3,"n_rows":0,"n_cols":0,"rows_kept":0,"cut":false,"hidden":true,"merged":[]}

{"sheet":"Sheet3","index":4,"n_rows":0,"n_cols":0,"rows_kept":0,"cut":false,"hidden":true,"merged":[]}

{"sheet":"Sheet4","index":5,"n_rows":0,"n_cols":0,"rows_kept":0,"cut":false,"hidden":true,"merged":[]}

{"sheet":"Sheet5","index":6,"n_rows":0,"n_cols":0,"rows_kept":0,"cut":false,"hidden":true,"merged":[]}

{"sheet":"Sheet6","index":7,"n_rows":18,"n_cols":3,"rows_kept":18,"cut":false,"hidden":true,"merged":[]}
[null,null,"60m"]
[null,null,"100m"]
[null,null,"200m"]
[null,null,"300m"]
[null,null,"400m"]
[null,null,"800m"]
[null,null,"1000m"]
[null,null,"1500m"]
[null,null,"3000m"]
[null,null,"5000m"]
[null,null,"80mH"]
[null,null,"100mH"]
[null,null,"110mH"]
[null,null,"100mYH"]
[null,null,"110mJH"]
{"$rows_left_out":4}
{"sheet":"Sheet1","index":8,"n_rows":0,"n_cols":0,"rows_kept":0,"cut":false,"hidden":true,"merged":[]}