{"text_format":"1","workbook":"xlsx","n_sheets":7,"sheets":["大会要項","入力表","申込確認シート","●初期設定（事務局）","Sheet1","リレーベスト記録入力表","●貼付（事務局）"],"not_rendered":{"charts":0,"images":0,"macros":0,"external_links":0,"defined_names":81,"comments":1,"pivot_tables":0},"unopened":[],"bounds":{"document_bytes":16777216,"sheet_cells":100000,"rows_first":2000,"rows_last":500,"rows_between":2000,"halvings":0,"cell_chars":16384,"cell_head_chars":4096},"cells_cut":0,"cells_raw":0,"read":"whole","date_system":"1900"}

{"sheet":"大会要項","index":0,"n_rows":109,"n_cols":14,"rows_kept":109,"cut":false,"hidden":false,"merged":[[108,1,108,2],[2,4,2,10],[4,0,4,9],[15,3,15,8],[16,1,22,1],[23,1,29,1],[30,0,30,8],[103,1,103,2],[103,3,103,5],[104,1,104,2],[105,1,105,2],[106,1,106,2],[107,1,107,2],[107,3,107,5],[108,3,108,5]]}
["平素より当協会の事業運営につきまして格別のご尽力を賜り厚くお礼申しあげます。"]
["さて、標記大会を下記の要領で開催いたしますので、各関係の皆様に周知方と併せて、多数参加くださいますようご案内申し上げます。"]
[null,null,null,null,"オホーツク陸上競技協会　会長　柿本　弘之（公印省略）"]
[]
["第４回 オホーツク陸協小学生陸上記録会　　　　　　　　　　　　　　兼 第４５回　北見市小学生陸上競技記録会　開催要項"]
[]
[" 1.主　　催","　オホーツク陸上競技協会"]
[" 2.共　　催","　北見市教育委員会　（公財）北見市体育協会 "]
{"$rows_left_out":102}
{"sheet":"入力表","index":1,"n_rows":55,"n_cols":74,"rows_kept":55,"cut":false,"hidden":false,"merged":[[2,36,3,37],[10,64,12,64],[10,65,12,65],[10,46,11,50],[6,6,10,12],[6,27,10,34],[1,56,3,66],[10,45,12,45],[10,51,12,51],[10,52,12,52],[10,53,12,53],[10,54,12,54],[10,55,12,55],[3,18,10,25],[12,67,12,68],[12,10,12,17],[12,19,12,26],[12,28,12,35],[10,56,12,56],[10,57,12,57],[10,58,12,58],[10,59,12,59],[10,60,12,60],[10,66,12,66],[10,61,12,61],[10,62,12,62],[10,63,12,63],[4,0,4,1],[4,2,4,4],[0,7,0,12],[0,0,0,4],[3,0,3,1],[3,2,3,4],[3,7,3,8],[3,9,3,12],[2,9,2,12],[2,7,2,8],[2,0,2,1],[2,2,2,4],[4,9,4,12],[6,2,6,4],[5,0,5,1],[5,2,5,4],[7,0,7,1],[7,2,7,4],[8,0,10,4],[0,27,0,37],[0,18,0,26],[5,6,5,12],[4,7,4,8],[4,36,10,37],[2,28,2,31],[2,32,2,34],[3,28,3,31],[3,32,3,34],[4,28,4,31],[4,32,4,34],[5,28,5,31],[5,32,5,34],[2,18,2,25],[6,0,6,1]]}
[{"$f":"'●初期設定（事務局）'!B3","v":"オホーツク陸協小学生記録会　兼　北見市小学生記録会"},null,null,null,null,null,"〆切",{"$f":"CONCATENATE('●初期設定（事務局）'!E3,'●初期設定（事務局）'!F3,'●初期設定（事務局）'!G3,'●初期設定（事務局）'!H3,'●初期設定（事務局）'!I3,'●初期設定（事務局）'!J3,'●初期設定（事務局）'!K3,'●初期設定（事務局）'!L3,'●初期設定（事務局）'!M3,'●初期設定（事務局）'!N3)","v":"9月10日（月）18：00"},null,null,null,null,null,null,null,null,null,null,"参加料",null,null,null,null,null,null,null,null,{"$f":"AC3*800+AC4*1000+AC5*300+AC6*1000","v":0}]
[null,null,null,null,null,null,null,null,null,null,null,null,null,null,null,null,null,null,null,null,null,null,null,null,null,null,null,null,null,null,null,null,null,null,null,null,null,null,null,null,null,null,null,null,null,null,null,null,null,null,null,null,null,null,null,null,"種目一覧"]
["団体種別",null,"小学",null,null,null,"審判員氏名","希望役職①",null,"希望役職②",null,null,null,null,null,null,null,null,"400mRベスト記録",null,null,null,null,null,null,null,null,"小２～６年　１種目",null,null,null,null,"名",null,null,null,"受付番号"]
["出場団体名",null,null,null,null,null,null,null,null,null,null,null,null,null,null,null,null,null,"ベスト記録については、別シートの入力表に入力して下さい。",null,null,null,null,null,null,null,null,"小２～６年　２種目",null,null,null,null,"名"]
["責任者",null,null,null,null,null,null,null,null,null,null,null,null,null,null,null,null,null,null,null,null,null,null,null,null,null,null,"小１・幼児　１種目",null,null,null,null,"名",null,null,null,"*事務局で記入"]
["緊急連絡先",null,null,null,null,null,"何かあれば、下記の欄にご記入ください！",null,null,null,null,null,null,null,null,null,null,null,null,null,null,null,null,null,null,null,null,"リレー",null,null,null,null,"名"]
["郵便番号",null,null,null,null,null,null,null,null,null,null,null,null,null,null,null,null,null,null,null,null,null,null,null,null,null,null,"選手数を入力すると参加料が自動計算されます。"]
["住　所"]
{"$rows_left_out":48}
{"sheet":"申込確認シート","index":2,"n_rows":226,"n_cols":7,"rows_kept":226,"cut":false,"hidden":true,"merged":[]}
[]
["1種目",1,null,{"$f":"IF(入力表!J14=\"\",\"・\",入力表!J14)","v":"・"},{"$f":"COUNTIF($D$2:D2,D2)","v":1},{"$f":"D2&E2","v":"・1"},{"$f":"SUBSTITUTE(IF(入力表!E14=\"\",\"\",入力表!E14),\"　\",\"\")","v":""}]
["1種目",2,null,{"$f":"IF(入力表!J15=\"\",\"・\",入力表!J15)","v":"・"},{"$f":"COUNTIF($D$2:D3,D3)","v":2},{"$f":"D3&E3","v":"・2"},{"$f":"SUBSTITUTE(IF(入力表!E15=\"\",\"\",入力表!E15),\"　\",\"\")","v":""}]
["1種目",3,null,{"$f":"IF(入力表!J16=\"\",\"・\",入力表!J16)","v":"・"},{"$f":"COUNTIF($D$2:D4,D4)","v":3},"・3",{"$f":"SUBSTITUTE(IF(入力表!E16=\"\",\"\",入力表!E16),\"　\",\"\")","v":""}]
["1種目",4,null,{"$f":"IF(入力表!J17=\"\",\"・\",入力表!J17)","v":"・"},{"$f":"COUNTIF($D$2:D5,D5)","v":4},"・4",{"$f":"SUBSTITUTE(IF(入力表!E17=\"\",\"\",入力表!E17),\"　\",\"\")","v":""}]
["1種目",5,null,{"$f":"IF(入力表!J18=\"\",\"・\",入力表!J18)","v":"・"},{"$f":"COUNTIF($D$2:D6,D6)","v":5},"・5",{"$f":"SUBSTITUTE(IF(入力表!E18=\"\",\"\",入力表!E18),\"　\",\"\")","v":""}]
["1種目",6,null,{"$f":"IF(入力表!J19=\"\",\"・\",入力表!J19)","v":"・"},{"$f":"COUNTIF($D$2:D7,D7)","v":6},"・6",{"$f":"SUBSTITUTE(IF(入力表!E19=\"\",\"\",入力表!E19),\"　\",\"\")","v":""}]
["1種目",7,null,{"$f":"IF(入力表!J20=\"\",\"・\",入力表!J20)","v":"・"},{"$f":"COUNTIF($D$2:D8,D8)","v":7},"・7",{"$f":"SUBSTITUTE(IF(入力表!E20=\"\",\"\",入力表!E20),\"　\",\"\")","v":""}]
{"$rows_left_out":219}
{"sheet":"●初期設定（事務局）","index":3,"n_rows":45,"n_cols":47,"rows_kept":45,"cut":false,"hidden":true,"merged":[[0,4,0,13],[0,25,1,25],[0,28,1,28],[0,31,1,31],[0,34,1,34],[0,37,1,37],[0,43,1,43],[0,40,1,40],[0,46,1,46],[0,19,1,19],[0,22,1,22],[4,4,4,13],[6,3,6,5],[7,3,7,5],[9,3,9,5],[10,3,10,5],[6,6,6,9],[7,6,7,9],[9,6,9,9],[10,6,10,9],[16,3,16,5],[17,3,17,5],[18,3,18,5],[19,3,19,5],[12,3,12,5],[13,3,13,5],[14,3,14,5],[15,3,15,5],[12,6,12,9],[21,3,21,5],[21,6,21,9],[11,3,11,5],[8,3,8,5],[8,6,8,9],[11,6,11,9],[20,3,20,5],[13,6,13,9],[15,6,15,9],[16,6,16,9],[14,6,14,9],[17,6,17,9],[18,6,18,9],[19,6,19,9],[20,6,20,9],[22,3,22,5],[22,6,22,9],[23,3,23,5],[23,6,23,9],[24,3,24,5],[24,6,24,9]]}
[1,"大会名の設定",null,2,"申込〆切",null,null,null,null,null,null,null,null,null,null,3,"申込〆切",null,null,"幼児男子",null,null,"幼児女子",null,null,"小学男子",null,null,"小学女子",null,null,"中学男子",null,null,"中学女子",null,null,"高校男子",null,null,"高校女子",null,null,"一般男子",null,null,"一般女子"]
[null,null,null,null,null,null,null,null,null,null,null,null,null,null,null,null,null,null,0,null,null,0,null,null,0,null,null,0,null,null,0,null,null,0,null,null,0,null,null,0,null,null,0,null,null,0]
[null,"オホーツク陸協小学生記録会　兼　北見市小学生記録会",null,null,9,"月",10,"日","（","月","）",18,"：","00",null,null,null,0,{"$f":"IF(R3=1,S2+1,S2)","v":0},"幼児男子60m",0,{"$f":"IF(U3=1,V2+1,V2)","v":0},"幼児女子60m",1,{"$f":"IF(X3=1,Y2+1,Y2)","v":1},"幼児男子60m",1,{"$f":"IF(AA3=1,AB2+1,AB2)","v":1},"幼児女子60m",null,{"$f":"IF(AD3=1,AE2+1,AE2)","v":0},"中学男2・3年100m",null,{"$f":"IF(AG3=1,AH2+1,AH2)","v":0},"中学女2・3年100m",null,{"$f":"IF(AJ3=1,AK2+1,AK2)","v":0},"男100m",null,{"$f":"IF(AM3=1,AN2+1,AN2)","v":0},"女100m",null,{"$f":"IF(AP3=1,AQ2+1,AQ2)","v":0},"男100m",null,{"$f":"IF(AS3=1,AT2+1,AT2)","v":0},"女100m"]
[null,null,null,null,null,null,null,null,null,null,null,null,null,null,null,null,null,null,{"$f":"IF(R4=1,S3+1,S3)","v":0},null,null,{"$f":"IF(U4=1,V3+1,V3)","v":0},null,1,{"$f":"IF(X4=1,Y3+1,Y3)","v":2},"小学男1年60m",1,{"$f":"IF(AA4=1,AB3+1,AB3)","v":2},"小学女1年60m",null,{"$f":"IF(AD4=1,AE3+1,AE3)","v":0},"中学男1年100m",null,{"$f":"IF(AG4=1,AH3+1,AH3)","v":0},"中学女1年100m",null,{"$f":"IF(AJ4=1,AK3+1,AK3)","v":0},"男200m",null,{"$f":"IF(AM4=1,AN3+1,AN3)","v":0},"女200m",null,{"$f":"IF(AP4=1,AQ3+1,AQ3)","v":0},"男200m",null,{"$f":"IF(AS4=1,AT3+1,AT3)","v":0},"女200m"]
[null,"大会名",null,4,"参加料",null,null,null,null,null,null,null,null,null,null,null,null,null,0,null,null,0,null,null,2,"小学男2年60m",null,2,"小学女2年60m",null,0,"中学男2年100m",null,0,"中学女2年100m",null,0,"男400m",null,0,"女400m",null,0,"男400m",null,0,"女400m"]
[null,null,null,null,null,null,null,null,null,null,null,null,null,null,null,null,null,null,0,null,null,0,null,1,3,"小学男2年100m",1,3,"小学女2年100m",null,0,"中学男3年100m",null,0,"中学女3年100m",null,0,"男800m",null,0,"女800m",null,0,"男800m",null,0,"女800m"]
[null,"オホーツク陸協　記録会第１戦",null,"幼児1",null,null,null,null,null,null,null,null,null,null,null,null,null,null,0,null,null,0,null,1,4,"小学男3年100m",1,4,"小学女3年100m",null,0,"中学男共通100m",null,0,"中学女共通100m",null,0,"男1000m",null,0,"女1000m",null,0,"男1000m",null,0,"女1000m"]
[null,"オホーツク陸協　記録会第２戦",null,"幼児2",null,null,null,null,null,null,null,null,null,null,null,null,null,null,0,null,null,0,null,1,5,"小学男4年100m",1,5,"小学女4年100m",null,0,"中学男200m",null,0,"中学女200m",null,0,"男1500m",null,0,"女1500m",null,0,"男1500m",null,0,"女1500m"]
{"$rows_left_out":38}
{"sheet":"Sheet1","index":4,"n_rows":0,"n_cols":0,"rows_kept":0,"cut":false,"hidden":true,"merged":[]}

{"sheet":"リレーベスト記録入力表","index":5,"n_rows":26,"n_cols":8,"rows_kept":26,"cut":false,"hidden":false,"merged":[[0,0,0,7]]}
["リレーベスト記録入力表"]
["例",1,"分",1,3,"秒",2,1]
["小3男A",null,"分",null,null,"秒"]
["小3男B",null,"分",null,null,"秒"]
["小3男C",null,"分",null,null,"秒"]
["小4男A",null,"分",null,null,"秒"]
["小4男B",null,"分",null,null,"秒"]
["小4男C",null,"分",null,null,"秒"]
{"$rows_left_out":19}
{"sheet":"●貼付（事務局）","index":6,"n_rows":41,"n_cols":50,"rows_kept":41,"cut":false,"hidden":false,"merged":[[0,20,0,27],[0,28,0,35],[0,36,0,43],[0,15,0,16],[0,17,0,18]]}
["数","性","NC","氏名","誕生年","ﾌﾘｶﾞﾅ","所属陸協","団体名","年","種目１","ベスト","種目２","ベスト","種目３","ベスト","4R",null,"16R",null,null,"種目1ベスト",null,null,null,null,null,null,null,"種目2ベスト",null,null,null,null,null,null,null,"種目3ベスト"]
[1,{"$f":"IF(ISBLANK(入力表!C14),\"\",入力表!C14)","v":""},{"$f":"IF(ISBLANK(入力表!D14),\"\",入力表!D14)","v":""},{"$f":"IF(ISBLANK(入力表!E14),\"\",入力表!E14)","v":""},{"$f":"RIGHT(入力表!F14,2)","v":""},{"$f":"IF(ISBLANK(入力表!G14),\"\",入力表!G14)","v":""},{"$f":"IF(ISBLANK(入力表!H14),\"\",入力表!H14)","v":"オホーツク"},{"$f":"IF(D2=\"\",\"\",入力表!$C$4)","v":""},{"$f":"IF(ISBLANK(入力表!I14),\"\",入力表!I14)","v":""},{"$f":"IF(入力表!J14=\"\",\"\",入力表!J14)","v":""},{"$f":"CONCATENATE(U2,V2,W2,X2,Y2,Z2,AA2,AB2)","v":""},{"$f":"IF(入力表!S14=\"\",\"\",入力表!S14)","v":""},{"$f":"CONCATENATE(AC2,AD2,AE2,AF2,AG2,AH2,AI2,AJ2)","v":""},{"$f":"IF(入力表!AB14=\"\",\"\",入力表!AB14)","v":""},{"$f":"CONCATENATE(AK2,AL2,AM2,AN2,AO2,AP2,AQ2,AR2)","v":""},{"$f":"IF(入力表!AK14=\"\",\"\",入力表!AK14)","v":""},{"$f":"IF(ISERROR(VLOOKUP(P2,$AW$3:$AX$8,2,FALSE)),\"\",VLOOKUP(P2,$AW$3:$AX$8,2,FALSE))","v":""},{"$f":"IF(入力表!AL14=\"\",\"\",入力表!AL14)","v":""},{"$f":"IF(ISERROR(VLOOKUP(R2,$AW$10:$AX$15,2,FALSE)),\"\",VLOOKUP(R2,$AW$10:$AX$15,2,FALSE))","v":""},{"$f":"入力表!C5","v":0},{"$f":"IF(入力表!K14=\"\",\"\",入力表!K14)","v":""},{"$f":"IF(入力表!L14=\"\",\"\",入力表!L14)","v":""},{"$f":"IF(ISERROR(VLOOKUP(IF(V2=\"\",\"\",入力表!M14),$AT$2:$AU$5,2,FALSE)),\"\",VLOOKUP(IF(V2=\"\",\"\",入力表!M14),$AT$2:$AU$5,2,FALSE))","v":""},{"$f":"IF(ISBLANK(入力表!N14),\"\",入力表!N14)","v":""},{"$f":"IF(ISBLANK(入力表!O14),\"\",入力表!O14)","v":""},{"$f":"IF(ISERROR(VLOOKUP(入力表!P14,$AT$2:$AU$5,2,FALSE)),\"\",VLOOKUP(入力表!P14,$AT$2:$AU$5,2,FALSE))","v":""},{"$f":"IF(ISBLANK(入力表!Q14),\"\",入力表!Q14)","v":""},{"$f":"IF(ISBLANK(入力表!R14),\"\",入力表!R14)","v":""},{"$f":"IF(入力表!T14=\"\",\"\",入力表!T14)","v":""},{"$f":"IF(入力表!U14=\"\",\"\",入力表!U14)","v":""},{"$f":"IF(ISERROR(VLOOKUP(IF(AD2=\"\",\"\",入力表!V14),$AT$2:$AU$5,2,FALSE)),\"\",VLOOKUP(IF(AD2=\"\",\"\",入力表!V14),$AT$2:$AU$5,2,FALSE))","v":""},{"$f":"IF(ISBLANK(入力表!W14),\"\",入力表!W14)","v":""},{"$f":"IF(ISBLANK(入力表!X14),\"\",入力表!X14)","v":""},{"$f":"IF(ISERROR(VLOOKUP(入力表!Y14,$AT$2:$AU$5,2,FALSE)),\"\",VLOOKUP(入力表!Y14,$AT$2:$AU$5,2,FALSE))","v":""},{"$f":"IF(ISBLANK(入力表!Z14),\"\",入力表!Z14)","v":""},{"$f":"IF(ISBLANK(入力表!AA14),\"\",入力表!AA14)","v":""},{"$f":"IF(入力表!AC14=\"\",\"\",入力表!AC14)","v":""},{"$f":"IF(入力表!AD14=\"\",\"\",入力表!AD14)","v":""},{"$f":"IF(ISERROR(VLOOKUP(IF(AL2=\"\",\"\",入力表!AE14),$AT$2:$AU$5,2,FALSE)),\"\",VLOOKUP(IF(AL2=\"\",\"\",入力表!AE14),$AT$2:$AU$5,2,FALSE))","v":""},{"$f":"IF(ISBLANK(入力表!AF14),\"\",入力表!AF14)","v":""},{"$f":"IF(ISBLANK(入力表!AG14),\"\",入力表!AG14)","v":""},{"$f":"IF(ISERROR(VLOOKUP(入力表!AH14,$AT$2:$AU$5,2,FALSE)),\"\",VLOOKUP(入力表!AH14,$AT$2:$AU$5,2,FALSE))","v":""},{"$f":"IF(ISBLANK(入力表!AI14),\"\",入力表!AI14)","v":""},{"$f":"IF(ISBLANK(入力表!AJ14),\"\",入力表!AJ14)","v":""},null,"分",".",null,"400mR"]
[2,{"$f":"IF(ISBLANK(入力表!C15),\"\",入力表!C15)","v":""},{"$f":"IF(ISBLANK(入力表!D15),\"\",入力表!D15)","v":""},{"$f":"IF(ISBLANK(入力表!E15),\"\",入力表!E15)","v":""},{"$f":"RIGHT(入力表!F15,2)","v":""},{"$f":"IF(ISBLANK(入力表!G15),\"\",入力表!G15)","v":""},{"$f":"IF(ISBLANK(入力表!H15),\"\",入力表!H15)","v":"オホーツク"},{"$f":"IF(D3=\"\",\"\",入力表!$C$4)","v":""},{"$f":"IF(ISBLANK(入力表!I15),\"\",入力表!I15)","v":""},{"$f":"IF(入力表!J15=\"\",\"\",入力表!J15)","v":""},"",{"$f":"IF(入力表!S15=\"\",\"\",入力表!S15)","v":""},"",{"$f":"IF(入力表!AB15=\"\",\"\",入力表!AB15)","v":""},{"$f":"CONCATENATE(AK3,AL3,AM3,AN3,AO3,AP3,AQ3,AR3)","v":""},{"$f":"IF(入力表!AK15=\"\",\"\",入力表!AK15)","v":""},{"$f":"IF(ISERROR(VLOOKUP(P3,$AW$3:$AX$8,2,FALSE)),\"\",VLOOKUP(P3,$AW$3:$AX$8,2,FALSE))","v":""},{"$f":"IF(入力表!AL15=\"\",\"\",入力表!AL15)","v":""},{"$f":"IF(ISERROR(VLOOKUP(R3,$AW$10:$AX$15,2,FALSE)),\"\",VLOOKUP(R3,$AW$10:$AX$15,2,FALSE))","v":""},null,{"$f":"IF(入力表!K15=\"\",\"\",入力表!K15)","v":""},{"$f":"IF(入力表!L15=\"\",\"\",入力表!L15)","v":""},{"$f":"IF(ISERROR(VLOOKUP(IF(V3=\"\",\"\",入力表!M15),$AT$2:$AU$5,2,FALSE)),\"\",VLOOKUP(IF(V3=\"\",\"\",入力表!M15),$AT$2:$AU$5,2,FALSE))","v":""},{"$f":"IF(ISBLANK(入力表!N15),\"\",入力表!N15)","v":""},{"$f":"IF(ISBLANK(入力表!O15),\"\",入力表!O15)","v":""},{"$f":"IF(ISERROR(VLOOKUP(入力表!P15,$AT$2:$AU$5,2,FALSE)),\"\",VLOOKUP(入力表!P15,$AT$2:$AU$5,2,FALSE))","v":""},{"$f":"IF(ISBLANK(入力表!Q15),\"\",入力表!Q15)","v":""},{"$f":"IF(ISBLANK(入力表!R15),\"\",入力表!R15)","v":""},{"$f":"IF(入力表!T15=\"\",\"\",入力表!T15)","v":""},{"$f":"IF(入力表!U15=\"\",\"\",入力表!U15)","v":""},{"$f":"IF(AD3=\"\",\"\",\".\")","v":""},{"$f":"IF(ISBLANK(入力表!W15),\"\",入力表!W15)","v":""},{"$f":"IF(ISBLANK(入力表!X15),\"\",入力表!X15)","v":""},{"$f":"IF(ISERROR(VLOOKUP(入力表!Y15,$AT$2:$AU$5,2,FALSE)),\"\",VLOOKUP(入力表!Y15,$AT$2:$AU$5,2,FALSE))","v":""},{"$f":"IF(ISBLANK(入力表!Z15),\"\",入力表!Z15)","v":""},{"$f":"IF(ISBLANK(入力表!AA15),\"\",入力表!AA15)","v":""},{"$f":"IF(入力表!AC15=\"\",\"\",入力表!AC15)","v":""},{"$f":"IF(入力表!AD15=\"\",\"\",入力表!AD15)","v":""},{"$f":"IF(ISERROR(VLOOKUP(IF(AL3=\"\",\"\",入力表!AE15),$AT$2:$AU$5,2,FALSE)),\"\",VLOOKUP(IF(AL3=\"\",\"\",入力表!AE15),$AT$2:$AU$5,2,FALSE))","v":""},{"$f":"IF(ISBLANK(入力表!AF15),\"\",入力表!AF15)","v":""},{"$f":"IF(ISBLANK(入力表!AG15),\"\",入力表!AG15)","v":""},{"$f":"IF(ISERROR(VLOOKUP(入力表!AH15,$AT$2:$AU$5,2,FALSE)),\"\",VLOOKUP(入力表!AH15,$AT$2:$AU$5,2,FALSE))","v":""},{"$f":"IF(ISBLANK(入力表!AI15),\"\",入力表!AI15)","v":""},{"$f":"IF(ISBLANK(入力表!AJ15),\"\",入力表!AJ15)","v":""},null,"秒",".",null,"男子A",{"$f":"CONCATENATE(入力表!T5,\".\",入力表!V5,入力表!W5,\".\",入力表!Y5,入力表!Z5)","v":".."}]
[3,{"$f":"IF(ISBLANK(入力表!C16),\"\",入力表!C16)","v":""},{"$f":"IF(ISBLANK(入力表!D16),\"\",入力表!D16)","v":""},{"$f":"IF(ISBLANK(入力表!E16),\"\",入力表!E16)","v":""},{"$f":"RIGHT(入力表!F16,2)","v":""},{"$f":"IF(ISBLANK(入力表!G16),\"\",入力表!G16)","v":""},{"$f":"IF(ISBLANK(入力表!H16),\"\",入力表!H16)","v":"オホーツク"},{"$f":"IF(D4=\"\",\"\",入力表!$C$4)","v":""},{"$f":"IF(ISBLANK(入力表!I16),\"\",入力表!I16)","v":""},{"$f":"IF(入力表!J16=\"\",\"\",入力表!J16)","v":""},"",{"$f":"IF(入力表!S16=\"\",\"\",入力表!S16)","v":""},"",{"$f":"IF(入力表!AB16=\"\",\"\",入力表!AB16)","v":""},"",{"$f":"IF(入力表!AK16=\"\",\"\",入力表!AK16)","v":""},"",{"$f":"IF(入力表!AL16=\"\",\"\",入力表!AL16)","v":""},"",null,{"$f":"IF(入力表!K16=\"\",\"\",入力表!K16)","v":""},{"$f":"IF(入力表!L16=\"\",\"\",入力表!L16)","v":""},{"$f":"IF(ISERROR(VLOOKUP(IF(V4=\"\",\"\",入力表!M16),$AT$2:$AU$5,2,FALSE)),\"\",VLOOKUP(IF(V4=\"\",\"\",入力表!M16),$AT$2:$AU$5,2,FALSE))","v":""},{"$f":"IF(ISBLANK(入力表!N16),\"\",入力表!N16)","v":""},{"$f":"IF(ISBLANK(入力表!O16),\"\",入力表!O16)","v":""},{"$f":"IF(ISERROR(VLOOKUP(入力表!P16,$AT$2:$AU$5,2,FALSE)),\"\",VLOOKUP(入力表!P16,$AT$2:$AU$5,2,FALSE))","v":""},{"$f":"IF(ISBLANK(入力表!Q16),\"\",入力表!Q16)","v":""},{"$f":"IF(ISBLANK(入力表!R16),\"\",入力表!R16)","v":""},{"$f":"IF(入力表!T16=\"\",\"\",入力表!T16)","v":""},{"$f":"IF(入力表!U16=\"\",\"\",入力表!U16)","v":""},"",{"$f":"IF(ISBLANK(入力表!W16),\"\",入力表!W16)","v":""},{"$f":"IF(ISBLANK(入力表!X16),\"\",入力表!X16)","v":""},{"$f":"IF(ISERROR(VLOOKUP(入力表!Y16,$AT$2:$AU$5,2,FALSE)),\"\",VLOOKUP(入力表!Y16,$AT$2:$AU$5,2,FALSE))","v":""},{"$f":"IF(ISBLANK(入力表!Z16),\"\",入力表!Z16)","v":""},{"$f":"IF(ISBLANK(入力表!AA16),\"\",入力表!AA16)","v":""},{"$f":"IF(入力表!AC16=\"\",\"\",入力表!AC16)","v":""},{"$f":"IF(入力表!AD16=\"\",\"\",入力表!AD16)","v":""},{"$f":"IF(ISERROR(VLOOKUP(IF(AL4=\"\",\"\",入力表!AE16),$AT$2:$AU$5,2,FALSE)),\"\",VLOOKUP(IF(AL4=\"\",\"\",入力表!AE16),$AT$2:$AU$5,2,FALSE))","v":""},{"$f":"IF(ISBLANK(入力表!AF16),\"\",入力表!AF16)","v":""},{"$f":"IF(ISBLANK(入力表!AG16),\"\",入力表!AG16)","v":""},{"$f":"IF(ISERROR(VLOOKUP(入力表!AH16,$AT$2:$AU$5,2,FALSE)),\"\",VLOOKUP(入力表!AH16,$AT$2:$AU$5,2,FALSE))","v":""},{"$f":"IF(ISBLANK(入力表!AI16),\"\",入力表!AI16)","v":""},{"$f":"IF(ISBLANK(入力表!AJ16),\"\",入力表!AJ16)","v":""},null,"m","m",null,"男子B",{"$f":"CONCATENATE(入力表!T6,\".\",入力表!V6,入力表!W6,\".\",入力表!Y6,入力表!Z6)","v":".."}]
[4,{"$f":"IF(ISBLANK(入力表!C17),\"\",入力表!C17)","v":""},{"$f":"IF(ISBLANK(入力表!D17),\"\",入力表!D17)","v":""},{"$f":"IF(ISBLANK(入力表!E17),\"\",入力表!E17)","v":""},{"$f":"RIGHT(入力表!F17,2)","v":""},{"$f":"IF(ISBLANK(入力表!G17),\"\",入力表!G17)","v":""},{"$f":"IF(ISBLANK(入力表!H17),\"\",入力表!H17)","v":"オホーツク"},{"$f":"IF(D5=\"\",\"\",入力表!$C$4)","v":""},{"$f":"IF(ISBLANK(入力表!I17),\"\",入力表!I17)","v":""},{"$f":"IF(入力表!J17=\"\",\"\",入力表!J17)","v":""},"",{"$f":"IF(入力表!S17=\"\",\"\",入力表!S17)","v":""},"",{"$f":"IF(入力表!AB17=\"\",\"\",入力表!AB17)","v":""},"",{"$f":"IF(入力表!AK17=\"\",\"\",入力表!AK17)","v":""},{"$f":"IF(ISERROR(VLOOKUP(P5,$AW$3:$AX$8,2,FALSE)),\"\",VLOOKUP(P5,$AW$3:$AX$8,2,FALSE))","v":""},{"$f":"IF(入力表!AL17=\"\",\"\",入力表!AL17)","v":""},{"$f":"IF(ISERROR(VLOOKUP(R5,$AW$10:$AX$15,2,FALSE)),\"\",VLOOKUP(R5,$AW$10:$AX$15,2,FALSE))","v":""},null,{"$f":"IF(入力表!K17=\"\",\"\",入力表!K17)","v":""},{"$f":"IF(入力表!L17=\"\",\"\",入力表!L17)","v":""},{"$f":"IF(ISERROR(VLOOKUP(IF(V5=\"\",\"\",入力表!M17),$AT$2:$AU$5,2,FALSE)),\"\",VLOOKUP(IF(V5=\"\",\"\",入力表!M17),$AT$2:$AU$5,2,FALSE))","v":""},{"$f":"IF(ISBLANK(入力表!N17),\"\",入力表!N17)","v":""},{"$f":"IF(ISBLANK(入力表!O17),\"\",入力表!O17)","v":""},{"$f":"IF(ISERROR(VLOOKUP(入力表!P17,$AT$2:$AU$5,2,FALSE)),\"\",VLOOKUP(入力表!P17,$AT$2:$AU$5,2,FALSE))","v":""},{"$f":"IF(ISBLANK(入力表!Q17),\"\",入力表!Q17)","v":""},{"$f":"IF(ISBLANK(入力表!R17),\"\",入力表!R17)","v":""},{"$f":"IF(入力表!T17=\"\",\"\",入力表!T17)","v":""},{"$f":"IF(入力表!U17=\"\",\"\",入力表!U17)","v":""},"",{"$f":"IF(ISBLANK(入力表!W17),\"\",入力表!W17)","v":""},{"$f":"IF(ISBLANK(入力表!X17),\"\",入力表!X17)","v":""},{"$f":"IF(ISERROR(VLOOKUP(入力表!Y17,$AT$2:$AU$5,2,FALSE)),\"\",VLOOKUP(入力表!Y17,$AT$2:$AU$5,2,FALSE))","v":""},{"$f":"IF(ISBLANK(入力表!Z17),\"\",入力表!Z17)","v":""},{"$f":"IF(ISBLANK(入力表!AA17),\"\",入力表!AA17)","v":""},{"$f":"IF(入力表!AC17=\"\",\"\",入力表!AC17)","v":""},{"$f":"IF(入力表!AD17=\"\",\"\",入力表!AD17)","v":""},{"$f":"IF(ISERROR(VLOOKUP(IF(AL5=\"\",\"\",入力表!AE17),$AT$2:$AU$5,2,FALSE)),\"\",VLOOKUP(IF(AL5=\"\",\"\",入力表!AE17),$AT$2:$AU$5,2,FALSE))","v":""},{"$f":"IF(ISBLANK(入力表!AF17),\"\",入力表!AF17)","v":""},{"$f":"IF(ISBLANK(入力表!AG17),\"\",入力表!AG17)","v":""},{"$f":"IF(ISERROR(VLOOKUP(入力表!AH17,$AT$2:$AU$5,2,FALSE)),\"\",VLOOKUP(入力表!AH17,$AT$2:$AU$5,2,FALSE))","v":""},{"$f":"IF(ISBLANK(入力表!AI17),\"\",入力表!AI17)","v":""},{"$f":"IF(ISBLANK(入力表!AJ17),\"\",入力表!AJ17)","v":""},null,null,null,null,"男子C",{"$f":"CONCATENATE(入力表!T7,\".\",入力表!V7,入力表!W7,\".\",入力表!Y7,入力表!Z7)","v":".."}]
[5,{"$f":"IF(ISBLANK(入力表!C18),\"\",入力表!C18)","v":""},{"$f":"IF(ISBLANK(入力表!D18),\"\",入力表!D18)","v":""},{"$f":"IF(ISBLANK(入力表!E18),\"\",入力表!E18)","v":""},{"$f":"RIGHT(入力表!F18,2)","v":""},{"$f":"IF(ISBLANK(入力表!G18),\"\",入力表!G18)","v":""},{"$f":"IF(ISBLANK(入力表!H18),\"\",入力表!H18)","v":"オホーツク"},{"$f":"IF(D6=\"\",\"\",入力表!$C$4)","v":""},{"$f":"IF(ISBLANK(入力表!I18),\"\",入力表!I18)","v":""},{"$f":"IF(入力表!J18=\"\",\"\",入力表!J18)","v":""},"",{"$f":"IF(入力表!S18=\"\",\"\",入力表!S18)","v":""},"",{"$f":"IF(入力表!AB18=\"\",\"\",入力表!AB18)","v":""},"",{"$f":"IF(入力表!AK18=\"\",\"\",入力表!AK18)","v":""},"",{"$f":"IF(入力表!AL18=\"\",\"\",入力表!AL18)","v":""},"",null,{"$f":"IF(入力表!K18=\"\",\"\",入力表!K18)","v":""},{"$f":"IF(入力表!L18=\"\",\"\",入力表!L18)","v":""},{"$f":"IF(ISERROR(VLOOKUP(IF(V6=\"\",\"\",入力表!M18),$AT$2:$AU$5,2,FALSE)),\"\",VLOOKUP(IF(V6=\"\",\"\",入力表!M18),$AT$2:$AU$5,2,FALSE))","v":""},{"$f":"IF(ISBLANK(入力表!N18),\"\",入力表!N18)","v":""},{"$f":"IF(ISBLANK(入力表!O18),\"\",入力表!O18)","v":""},{"$f":"IF(ISERROR(VLOOKUP(入力表!P18,$AT$2:$AU$5,2,FALSE)),\"\",VLOOKUP(入力表!P18,$AT$2:$AU$5,2,FALSE))","v":""},{"$f":"IF(ISBLANK(入力表!Q18),\"\",入力表!Q18)","v":""},{"$f":"IF(ISBLANK(入力表!R18),\"\",入力表!R18)","v":""},{"$f":"IF(入力表!T18=\"\",\"\",入力表!T18)","v":""},{"$f":"IF(入力表!U18=\"\",\"\",入力表!U18)","v":""},"",{"$f":"IF(ISBLANK(入力表!W18),\"\",入力表!W18)","v":""},{"$f":"IF(ISBLANK(入力表!X18),\"\",入力表!X18)","v":""},{"$f":"IF(ISERROR(VLOOKUP(入力表!Y18,$AT$2:$AU$5,2,FALSE)),\"\",VLOOKUP(入力表!Y18,$AT$2:$AU$5,2,FALSE))","v":""},{"$f":"IF(ISBLANK(入力表!Z18),\"\",入力表!Z18)","v":""},{"$f":"IF(ISBLANK(入力表!AA18),\"\",入力表!AA18)","v":""},{"$f":"IF(入力表!AC18=\"\",\"\",入力表!AC18)","v":""},{"$f":"IF(入力表!AD18=\"\",\"\",入力表!AD18)","v":""},{"$f":"IF(ISERROR(VLOOKUP(IF(AL6=\"\",\"\",入力表!AE18),$AT$2:$AU$5,2,FALSE)),\"\",VLOOKUP(IF(AL6=\"\",\"\",入力表!AE18),$AT$2:$AU$5,2,FALSE))","v":""},{"$f":"IF(ISBLANK(入力表!AF18),\"\",入力表!AF18)","v":""},{"$f":"IF(ISBLANK(入力表!AG18),\"\",入力表!AG18)","v":""},{"$f":"IF(ISERROR(VLOOKUP(入力表!AH18,$AT$2:$AU$5,2,FALSE)),\"\",VLOOKUP(入力表!AH18,$AT$2:$AU$5,2,FALSE))","v":""},{"$f":"IF(ISBLANK(入力表!AI18),\"\",入力表!AI18)","v":""},{"$f":"IF(ISBLANK(入力表!AJ18),\"\",入力表!AJ18)","v":""},null,null,null,null,"女子A",{"$f":"CONCATENATE(入力表!T9,\".\",入力表!V9,入力表!W9,\".\",入力表!Y9,入力表!Z9)","v":".."}]
[6,{"$f":"IF(ISBLANK(入力表!C19),\"\",入力表!C19)","v":""},{"$f":"IF(ISBLANK(入力表!D19),\"\",入力表!D19)","v":""},{"$f":"IF(ISBLANK(入力表!E19),\"\",入力表!E19)","v":""},{"$f":"RIGHT(入力表!F19,2)","v":""},{"$f":"IF(ISBLANK(入力表!G19),\"\",入力表!G19)","v":""},{"$f":"IF(ISBLANK(入力表!H19),\"\",入力表!H19)","v":"オホーツク"},{"$f":"IF(D7=\"\",\"\",入力表!$C$4)","v":""},{"$f":"IF(ISBLANK(入力表!I19),\"\",入力表!I19)","v":""},{"$f":"IF(入力表!J19=\"\",\"\",入力表!J19)","v":""},"",{"$f":"IF(入力表!S19=\"\",\"\",入力表!S19)","v":""},"",{"$f":"IF(入力表!AB19=\"\",\"\",入力表!AB19)","v":""},"",{"$f":"IF(入力表!AK19=\"\",\"\",入力表!AK19)","v":""},"",{"$f":"IF(入力表!AL19=\"\",\"\",入力表!AL19)","v":""},"",null,{"$f":"IF(入力表!K19=\"\",\"\",入力表!K19)","v":""},{"$f":"IF(入力表!L19=\"\",\"\",入力表!L19)","v":""},{"$f":"IF(ISERROR(VLOOKUP(IF(V7=\"\",\"\",入力表!M19),$AT$2:$AU$5,2,FALSE)),\"\",VLOOKUP(IF(V7=\"\",\"\",入力表!M19),$AT$2:$AU$5,2,FALSE))","v":""},{"$f":"IF(ISBLANK(入力表!N19),\"\",入力表!N19)","v":""},{"$f":"IF(ISBLANK(入力表!O19),\"\",入力表!O19)","v":""},{"$f":"IF(ISERROR(VLOOKUP(入力表!P19,$AT$2:$AU$5,2,FALSE)),\"\",VLOOKUP(入力表!P19,$AT$2:$AU$5,2,FALSE))","v":""},{"$f":"IF(ISBLANK(入力表!Q19),\"\",入力表!Q19)","v":""},{"$f":"IF(ISBLANK(入力表!R19),\"\",入力表!R19)","v":""},{"$f":"IF(入力表!T19=\"\",\"\",入力表!T19)","v":""},{"$f":"IF(入力表!U19=\"\",\"\",入力表!U19)","v":""},"",{"$f":"IF(ISBLANK(入力表!W19),\"\",入力表!W19)","v":""},{"$f":"IF(ISBLANK(入力表!X19),\"\",入力表!X19)","v":""},{"$f":"IF(ISERROR(VLOOKUP(入力表!Y19,$AT$2:$AU$5,2,FALSE)),\"\",VLOOKUP(入力表!Y19,$AT$2:$AU$5,2,FALSE))","v":""},{"$f":"IF(ISBLANK(入力表!Z19),\"\",入力表!Z19)","v":""},{"$f":"IF(ISBLANK(入力表!AA19),\"\",入力表!AA19)","v":""},{"$f":"IF(入力表!AC19=\"\",\"\",入力表!AC19)","v":""},{"$f":"IF(入力表!AD19=\"\",\"\",入力表!AD19)","v":""},{"$f":"IF(ISERROR(VLOOKUP(IF(AL7=\"\",\"\",入力表!AE19),$AT$2:$AU$5,2,FALSE)),\"\",VLOOKUP(IF(AL7=\"\",\"\",入力表!AE19),$AT$2:$AU$5,2,FALSE))","v":""},{"$f":"IF(ISBLANK(入力表!AF19),\"\",入力表!AF19)","v":""},{"$f":"IF(ISBLANK(入力表!AG19),\"\",入力表!AG19)","v":""},{"$f":"IF(ISERROR(VLOOKUP(入力表!AH19,$AT$2:$AU$5,2,FALSE)),\"\",VLOOKUP(入力表!AH19,$AT$2:$AU$5,2,FALSE))","v":""},{"$f":"IF(ISBLANK(入力表!AI19),\"\",入力表!AI19)","v":""},{"$f":"IF(ISBLANK(入力表!AJ19),\"\",入力表!AJ19)","v":""},null,null,null,null,"女子B",{"$f":"CONCATENATE(入力表!T10,\".\",入力表!V10,入力表!W10,\".\",入力表!Y10,入力表!Z10)","v":".."}]
[7,{"$f":"IF(ISBLANK(入力表!C20),\"\",入力表!C20)","v":""},{"$f":"IF(ISBLANK(入力表!D20),\"\",入力表!D20)","v":""},{"$f":"IF(ISBLANK(入力表!E20),\"\",入力表!E20)","v":""},{"$f":"RIGHT(入力表!F20,2)","v":""},{"$f":"IF(ISBLANK(入力表!G20),\"\",入力表!G20)","v":""},{"$f":"IF(ISBLANK(入力表!H20),\"\",入力表!H20)","v":"オホーツク"},{"$f":"IF(D8=\"\",\"\",入力表!$C$4)","v":""},{"$f":"IF(ISBLANK(入力表!I20),\"\",入力表!I20)","v":""},{"$f":"IF(入力表!J20=\"\",\"\",入力表!J20)","v":""},"",{"$f":"IF(入力表!S20=\"\",\"\",入力表!S20)","v":""},"",{"$f":"IF(入力表!AB20=\"\",\"\",入力表!AB20)","v":""},"",{"$f":"IF(入力表!AK20=\"\",\"\",入力表!AK20)","v":""},"",{"$f":"IF(入力表!AL20=\"\",\"\",入力表!AL20)","v":""},"",null,{"$f":"IF(入力表!K20=\"\",\"\",入力表!K20)","v":""},{"$f":"IF(入力表!L20=\"\",\"\",入力表!L20)","v":""},{"$f":"IF(ISERROR(VLOOKUP(IF(V8=\"\",\"\",入力表!M20),$AT$2:$AU$5,2,FALSE)),\"\",VLOOKUP(IF(V8=\"\",\"\",入力表!M20),$AT$2:$AU$5,2,FALSE))","v":""},{"$f":"IF(ISBLANK(入力表!N20),\"\",入力表!N20)","v":""},{"$f":"IF(ISBLANK(入力表!O20),\"\",入力表!O20)","v":""},{"$f":"IF(ISERROR(VLOOKUP(入力表!P20,$AT$2:$AU$5,2,FALSE)),\"\",VLOOKUP(入力表!P20,$AT$2:$AU$5,2,FALSE))","v":""},{"$f":"IF(ISBLANK(入力表!Q20),\"\",入力表!Q20)","v":""},{"$f":"IF(ISBLANK(入力表!R20),\"\",入力表!R20)","v":""},{"$f":"IF(入力表!T20=\"\",\"\",入力表!T20)","v":""},{"$f":"IF(入力表!U20=\"\",\"\",入力表!U20)","v":""},"",{"$f":"IF(ISBLANK(入力表!W20),\"\",入力表!W20)","v":""},{"$f":"IF(ISBLANK(入力表!X20),\"\",入力表!X20)","v":""},{"$f":"IF(ISERROR(VLOOKUP(入力表!Y20,$AT$2:$AU$5,2,FALSE)),\"\",VLOOKUP(入力表!Y20,$AT$2:$AU$5,2,FALSE))","v":""},{"$f":"IF(ISBLANK(入力表!Z20),\"\",入力表!Z20)","v":""},{"$f":"IF(ISBLANK(入力表!AA20),\"\",入力表!AA20)","v":""},{"$f":"IF(入力表!AC20=\"\",\"\",入力表!AC20)","v":""},{"$f":"IF(入力表!AD20=\"\",\"\",入力表!AD20)","v":""},{"$f":"IF(ISERROR(VLOOKUP(IF(AL8=\"\",\"\",入力表!AE20),$AT$2:$AU$5,2,FALSE)),\"\",VLOOKUP(IF(AL8=\"\",\"\",入力表!AE20),$AT$2:$AU$5,2,FALSE))","v":""},{"$f":"IF(ISBLANK(入力表!AF20),\"\",入力表!AF20)","v":""},{"$f":"IF(ISBLANK(入力表!AG20),\"\",入力表!AG20)","v":""},{"$f":"IF(ISERROR(VLOOKUP(入力表!AH20,$AT$2:$AU$5,2,FALSE)),\"\",VLOOKUP(入力表!AH20,$AT$2:$AU$5,2,FALSE))","v":""},{"$f":"IF(ISBLANK(入力表!AI20),\"\",入力表!AI20)","v":""},{"$f":"IF(ISBLANK(入力表!AJ20),\"\",入力表!AJ20)","v":""},null,null,null,null,"女子C",{"$f":"CONCATENATE(入力表!T11,\".\",入力表!V11,入力表!W11,\".\",入力表!Y11,入力表!Z11)","v":".."}]
{"$rows_left_out":33}