{"text_format":"1","workbook":"xlsx","n_sheets":5,"sheets":["大会規定","大会要項","申込書","事務局シート","ﾅﾝﾊﾞｰｶｰﾄﾞ"],"not_rendered":{"charts":0,"images":0,"macros":0,"external_links":0,"defined_names":6,"comments":0,"pivot_tables":0},"unopened":[],"bounds":{"document_bytes":16777216,"sheet_cells":100000,"rows_first":2000,"rows_last":500,"rows_between":2000,"halvings":0,"cell_chars":16384,"cell_head_chars":4096},"cells_cut":0,"cells_raw":0,"read":"whole","date_system":"1900"}

{"sheet":"大会規定","index":0,"n_rows":74,"n_cols":22,"rows_kept":74,"cut":false,"hidden":false,"merged":[[0,0,0,9],[0,10,0,25],[24,1,24,24],[2,0,2,7],[5,0,5,7],[7,0,7,7],[34,3,34,25],[13,1,16,5],[13,6,13,10],[30,1,30,2],[31,1,32,2],[33,1,33,2],[34,1,40,2],[40,3,40,14],[13,11,13,25],[14,11,14,25],[12,6,12,10],[25,0,25,7],[22,1,22,24],[20,0,20,7],[36,15,36,21],[37,15,37,20],[3,1,3,25],[4,1,4,25],[51,1,51,25],[57,21,57,24],[57,17,57,20],[56,13,56,16],[55,21,55,24],[52,9,52,12],[53,9,53,12],[52,17,52,20],[53,17,53,20],[52,13,52,16],[53,13,53,16],[52,21,52,24],[56,17,56,20],[57,13,57,16],[54,17,54,20],[54,5,54,8],[55,5,55,8],[57,1,57,4],[55,17,55,20],[9,1,12,5],[6,1,6,24],[8,1,8,24],[9,6,9,10],[10,6,10,10],[11,6,11,10],[9,11,9,25],[10,11,10,25],[11,11,11,25],[12,11,12,25],[14,6,14,10],[15,6,15,10],[16,6,16,10],[15,11,15,25],[16,11,16,25],[54,21,54,24],[56,9,56,12],[57,9,57,12],[56,21,56,24],[30,3,30,25],[36,3,36,14],[37,3,37,14],[38,15,38,20],[38,3,38,14],[35,3,35,25],[47,0,47,7],[43,1,43,25],[45,1,45,25],[48,1,48,25],[46,1,46,25],[39,3,39,14],[42,0,42,7],[44,0,44,7],[50,1,50,25],[54,1,54,4],[55,1,55,4],[54,13,54,16],[55,13,55,16],[56,5,56,8],[26,1,26,2],[26,3,26,25],[28,3,28,25],[28,1,29,2],[39,15,39,20],[40,15,40,20],[31,3,31,25],[32,3,32,25],[29,3,29,25],[33,3,33,25],[27,3,27,9],[19,1,19,24],[21,1,21,24],[41,1,41,2],[41,3,41,26],[17,1,17,24],[18,1,18,24],[74,5,74,8],[72,17,72,20],[68,21,68,24],[68,17,68,20],[71,17,71,20],[62,1,62,25],[72,9,72,12],[23,1,23,24],[52,1,52,4],[53,1,53,4],[54,9,54,12],[55,9,55,12],[67,5,67,8],[68,5,68,8],[68,9,68,12],[65,1,65,25],[66,1,66,4],[67,1,67,4],[49,1,49,25],[72,21,72,24],[70,17,70,20],[71,13,71,16],[72,13,72,16],[71,21,71,24],[66,21,66,24],[58,13,58,16],[58,9,58,12],[59,5,59,8],[59,1,59,4],[59,21,59,23],[58,17,58,20],[58,1,58,4],[59,9,59,12],[69,17,69,20],[69,13,69,16],[61,0,61,7],[70,5,70,8],[57,5,57,8],[58,5,58,8],[52,5,52,8],[53,5,53,8],[53,21,53,24],[74,1,74,4],[70,9,70,12],[67,9,67,12],[67,13,67,16],[68,1,68,4],[66,13,66,16],[66,9,66,12],[56,1,56,4],[68,13,68,16],[63,1,63,25],[64,1,64,25],[70,21,70,24],[69,21,69,24],[69,1,69,4],[70,1,70,4],[67,17,67,24],[58,21,58,24],[74,14,74,16],[69,5,69,8],[60,1,60,24],[69,9,69,12],[70,13,70,16],[71,5,71,8],[66,17,66,20],[66,5,66,8],[74,9,74,12],[71,9,71,12],[72,5,72,8],[73,5,73,8],[73,9,73,12],[71,1,71,4],[72,1,72,4],[73,1,73,4]]}
["陸上競技の部",null,null,null,null,null,null,null,null,null,"『平成３０年度　オホーツク中学校体育大会規定』"]
[]
["（１）日　　程"]
[null,"原則として、６月第３週までに行う。今年度は、６月１５日（金）・１６日（土）"]
[null,"今年度の開催地は、北見東陵公園陸上競技場"]
["（２）監督及び選手"]
[null,"監督１名以上　　　選手　～　出場制限内人数"]
["（３）競技種目"]
[null,"男子　……　１８種目　　女子　……　１４種目"]
[null,"男子",null,null,null,null,"１　　　　年",null,null,null,null,"１００Ｍ、１５００Ｍ、１００ＭＨ、◎砲丸投（2.721kg）"]
{"$rows_left_out":65}
{"sheet":"大会要項","index":1,"n_rows":58,"n_cols":25,"rows_kept":58,"cut":false,"hidden":false,"merged":[[54,6,54,25],[35,6,35,24],[34,6,34,25],[0,0,0,25],[9,14,9,19],[10,14,10,19],[9,20,9,25],[17,13,17,15],[17,16,17,25],[12,13,12,17],[12,18,12,25],[1,0,1,25],[2,0,2,25],[11,6,11,25],[3,0,3,25],[5,1,5,4],[6,1,6,4],[10,6,10,8],[10,9,10,13],[5,6,5,25],[9,6,9,8],[9,9,9,13],[8,6,8,18],[13,13,13,25],[14,13,14,25],[15,13,15,25],[16,13,16,25],[12,10,12,12],[13,10,13,12],[14,10,16,12],[12,6,16,9],[32,6,32,25],[27,18,27,19],[24,21,24,22],[25,21,25,22],[26,21,26,22],[27,21,27,22],[27,16,27,17],[22,6,22,25],[33,6,33,25],[29,6,29,25],[30,6,30,25],[31,6,31,25],[17,10,17,12],[18,10,18,12],[19,10,21,12],[17,6,21,9],[23,6,23,25],[18,13,18,25],[19,13,19,25],[20,13,20,25],[21,13,21,25],[24,13,24,15],[25,13,25,15],[26,13,26,15],[27,13,27,15],[26,7,26,9],[27,7,27,9],[24,16,24,17],[25,16,25,17],[26,16,26,17],[25,18,25,19],[26,18,26,19],[42,6,42,9],[43,6,44,6],[43,7,44,9],[24,18,24,19],[41,6,41,25],[40,6,40,25],[39,6,39,10],[39,11,39,15],[38,6,38,15],[39,16,39,25],[38,16,38,25],[36,6,36,25],[37,6,37,25],[24,10,24,12],[25,10,25,12],[26,10,26,12],[27,10,27,12],[28,6,28,25],[24,24,24,25],[25,24,25,25],[26,24,26,25],[27,24,27,25],[24,7,24,9],[25,7,25,9],[29,1,29,4],[53,6,53,25],[55,6,55,25],[57,6,57,25],[56,6,56,25],[50,6,50,25],[51,6,51,25],[52,6,52,25],[47,6,47,7],[48,6,48,7],[49,6,49,7],[47,8,47,25],[48,8,48,25],[49,8,49,25],[46,1,46,4],[47,1,47,4],[46,6,46,25],[43,10,44,16],[45,10,45,16],[42,10,42,16],[42,17,42,25],[45,17,45,25],[43,17,44,25],[45,7,45,9],[24,1,24,4],[25,1,25,4],[26,1,26,4],[27,1,27,4],[28,1,28,4],[7,1,7,4],[8,1,8,4],[9,1,9,4],[10,1,10,4],[11,1,11,4],[21,1,21,4],[23,1,23,4],[12,1,12,4],[13,1,13,4],[14,1,14,4],[15,1,15,4],[16,1,16,4],[17,1,17,4],[18,1,18,4],[19,1,19,4],[20,1,20,4],[53,1,53,4],[55,1,55,4],[56,1,56,4],[57,1,57,4],[48,1,48,4],[49,1,49,4],[50,1,50,4],[51,1,51,4],[52,1,52,4],[30,1,30,4],[31,1,31,4],[41,1,41,4],[42,1,42,4],[43,1,43,4],[44,1,44,4],[45,1,45,4],[36,1,36,4],[37,1,37,4],[38,1,38,4],[39,1,39,4],[40,1,40,4],[32,1,32,4],[33,1,33,4]]}
["平成３０年度　オホーツク中学校体育大会"]
["第５１回　オホーツク中学校陸上競技大会開催要項"]
["兼　第４９回　北海道中学校陸上競技大会標準記録突破指定大会　オホーツク予選会"]
["兼　第４５回　全日本中学校陸上競技選手権大会四種競技標準記録突破指定大会"]
[]
[1,"主　　催",null,null,null,null,"オホーツク中学校体育連盟、オホーツク陸上競技協会"]
[2,"後　　援",null,null,null,null,"北海道教育庁オホーツク教育局、北見市教育委員会"]
[3,"主　　管",null,null,null,null,"オホーツク中学校体育連盟"]
[4,"期　　日",null,null,null,null,"平成３０年６月１５日（金）　～　６月１６日（土）"]
[null,null,null,null,null,null,"１日目",null,null,"開会式      　８時４５分",null,null,null,null,"競技開始  　９時４５分",null,null,null,null,null,"競技終了　 １５時４５分予定"]
{"$rows_left_out":49}
{"sheet":"申込書","index":2,"n_rows":97,"n_cols":94,"rows_kept":97,"cut":false,"hidden":false,"merged":[[57,7,57,8],[4,77,6,77],[4,81,6,81],[4,85,6,85],[16,25,16,30],[16,31,16,36],[16,37,16,42],[16,43,16,48],[16,49,16,54],[16,55,16,60],[48,7,48,8],[49,7,49,8],[50,7,50,8],[51,7,51,8],[52,7,52,8],[53,7,53,8],[54,7,54,8],[55,7,55,8],[56,7,56,8],[39,7,39,8],[40,7,40,8],[41,7,41,8],[42,7,42,8],[43,7,43,8],[44,7,44,8],[45,7,45,8],[46,7,46,8],[47,7,47,8],[30,7,30,8],[31,7,31,8],[32,7,32,8],[33,7,33,8],[34,7,34,8],[35,7,35,8],[36,7,36,8],[37,7,37,8],[38,7,38,8],[21,7,21,8],[22,7,22,8],[23,7,23,8],[24,7,24,8],[25,7,25,8],[26,7,26,8],[27,7,27,8],[28,7,28,8],[29,7,29,8],[12,7,12,8],[13,7,13,8],[14,7,14,8],[15,7,15,8],[16,7,16,8],[17,7,17,8],[18,7,18,8],[19,7,19,8],[20,7,20,8],[55,19,57,24],[55,25,57,48],[4,75,6,75],[4,76,6,76],[4,78,6,78],[4,79,6,79],[4,80,6,80],[4,82,6,82],[49,16,49,21],[29,16,29,21],[34,16,34,21],[35,16,35,21],[36,16,36,21],[37,16,37,21],[38,16,38,21],[39,16,39,21],[40,16,40,21],[41,16,41,21],[46,16,46,21],[42,16,42,21],[43,16,43,21],[44,16,44,21],[23,16,23,21],[24,16,24,21],[25,16,25,21],[27,16,27,21],[28,16,28,21],[30,16,30,21],[31,16,31,21],[32,16,32,21],[33,16,33,21],[26,16,26,21],[17,14,34,15],[35,14,49,15],[17,22,17,24],[18,22,18,24],[19,22,19,24],[20,22,20,24],[21,22,21,24],[22,22,22,24],[23,22,23,24],[24,22,24,24],[25,22,25,24],[26,22,26,24],[27,22,27,24],[28,22,28,24],[29,22,29,24],[21,16,21,21],[17,16,17,21],[18,16,18,21],[19,16,19,21],[20,16,20,21],[45,16,45,21],[47,16,47,21],[48,16,48,21],[22,16,22,21],[49,22,49,24],[17,25,17,30],[18,25,18,30],[19,25,19,30],[20,25,20,30],[21,25,21,30],[22,25,22,30],[23,25,23,30],[24,25,24,30],[25,25,25,30],[26,25,26,30],[27,25,27,30],[28,25,28,30],[29,25,29,30],[40,22,40,24],[41,22,41,24],[42,22,42,24],[43,22,43,24],[44,22,44,24],[35,22,35,24],[36,22,36,24],[37,22,37,24],[38,22,38,24],[39,22,39,24],[38,25,38,30],[39,25,39,30],[30,25,30,30],[31,25,31,30],[32,25,32,30],[33,25,33,30],[34,25,34,30],[36,25,36,30],[37,25,37,30],[47,22,47,24],[48,22,48,24],[30,22,30,24],[31,22,31,24],[32,22,32,24],[33,22,33,24],[34,22,34,24],[45,22,45,24],[46,22,46,24],[45,25,45,30],[46,25,46,30],[47,25,47,30],[48,25,48,30],[49,25,49,30],[17,31,17,36],[17,37,17,42],[19,31,19,36],[19,37,19,42],[21,31,21,36],[21,37,21,42],[23,31,23,36],[23,37,23,42],[25,31,25,36],[25,37,25,42],[27,31,27,36],[27,37,27,42],[29,31,29,36],[40,25,40,30],[41,25,41,30],[42,25,42,30],[43,25,43,30],[44,25,44,30],[35,25,35,30],[19,43,19,48],[19,49,19,54],[19,55,19,60],[20,31,20,36],[20,37,20,42],[20,43,20,48],[20,49,20,54],[20,55,20,60],[17,43,17,48],[17,49,17,54],[17,55,17,60],[18,31,18,36],[18,37,18,42],[18,43,18,48],[18,49,18,54],[18,55,18,60],[23,43,23,48],[23,49,23,54],[23,55,23,60],[24,31,24,36],[24,37,24,42],[24,43,24,48],[24,49,24,54],[24,55,24,60],[21,43,21,48],[21,49,21,54],[21,55,21,60],[22,31,22,36],[22,37,22,42],[22,43,22,48],[22,49,22,54],[22,55,22,60],[27,43,27,48],[27,49,27,54],[27,55,27,60],[28,31,28,36],[28,37,28,42],[28,43,28,48],[28,49,28,54],[28,55,28,60],[25,43,25,48],[25,49,25,54],[25,55,25,60],[26,31,26,36],[26,37,26,42],[26,43,26,48],[26,49,26,54],[26,55,26,60],[31,31,31,36],[31,37,31,42],[31,43,31,48],[31,49,31,54],[31,55,31,60],[29,37,29,42],[29,43,29,48],[29,49,29,54],[29,55,29,60],[30,31,30,36],[30,37,30,42],[30,43,30,48],[30,49,30,54],[30,55,30,60],[33,31,33,36],[33,37,33,42],[33,43,33,48],[33,49,33,54],[33,55,33,60],[32,31,32,36],[32,37,32,42],[32,43,32,48],[32,49,32,54],[32,55,32,60],[35,31,35,36],[35,37,35,42],[35,43,35,48],[35,49,35,54],[35,55,35,60],[34,31,34,36],[34,37,34,42],[34,43,34,48],[34,49,34,54],[34,55,34,60],[37,31,37,36],[37,37,37,42],[37,43,37,48],[37,49,37,54],[37,55,37,60],[36,31,36,36],[36,37,36,42],[36,43,36,48],[36,49,36,54],[36,55,36,60],[39,31,39,36],[39,37,39,42],[39,43,39,48],[39,49,39,54],[39,55,39,60],[38,31,38,36],[38,37,38,42],[38,43,38,48],[38,49,38,54],[38,55,38,60],[41,31,41,36],[41,37,41,42],[41,43,41,48],[41,49,41,54],[41,55,41,60],[40,31,40,36],[40,37,40,42],[40,43,40,48],[40,49,40,54],[40,55,40,60],[43,31,43,36],[43,37,43,42],[43,43,43,48],[43,49,43,54],[43,55,43,60],[42,31,42,36],[42,37,42,42],[42,43,42,48],[42,49,42,54],[42,55,42,60],[46,43,46,48],[46,49,46,54],[46,55,46,60],[45,31,45,36],[44,31,44,36],[44,37,44,42],[44,43,44,48],[44,49,44,54],[44,55,44,60],[5,0,6,3],[7,0,7,2],[7,3,7,4],[7,5,7,7],[0,0,3,10],[0,32,3,38],[0,39,3,60],[49,31,49,36],[49,37,49,42],[49,43,49,48],[49,49,49,54],[49,55,49,60],[48,31,48,36],[48,37,48,42],[48,43,48,48],[48,49,48,54],[48,55,48,60],[47,31,47,36],[47,37,47,42],[47,43,47,48],[47,49,47,54],[47,55,47,60],[46,31,46,36],[46,37,46,42],[8,16,8,19],[9,16,9,19],[7,11,7,12],[8,11,8,12],[8,0,9,3],[8,4,8,5],[9,4,9,5],[8,6,8,7],[9,6,9,7],[4,89,6,91],[4,92,6,92],[11,0,11,3],[50,14,51,60],[9,11,9,12],[11,14,11,28],[12,14,13,17],[12,18,13,28],[12,29,13,32],[5,45,6,59],[7,45,7,47],[8,45,8,47],[9,45,9,47],[7,48,7,52],[8,48,8,52],[9,48,9,52],[7,53,7,55],[8,53,8,55],[9,53,9,55],[7,56,7,60],[8,56,8,60],[9,56,9,60],[5,9,6,10],[7,16,7,19],[0,69,3,70],[0,71,3,71],[4,93,6,93],[55,49,57,53],[52,16,54,57],[4,86,6,88],[7,30,9,41],[12,33,13,43],[7,28,9,29],[7,20,7,24],[8,20,8,24],[9,20,9,24],[7,25,7,27],[8,25,8,27],[9,25,9,27],[5,16,6,30],[5,31,6,31],[45,37,45,42],[45,43,45,48],[45,49,45,54],[45,55,45,60],[4,83,6,83],[0,72,3,93],[15,14,15,28]]}
["第５１回　オホーツク中学校陸上競技大会申込書",null,null,null,null,null,null,null,null,null,null,null,null,null,null,null,null,null,null,null,null,null,null,null,null,null,null,null,null,null,null,null,"〆切",null,null,null,null,null,null,"5/16(水)16：00",null,null,null,null,null,null,null,null,null,null,null,null,null,null,null,null,null,null,null,null,null,null,null,null,null,null,null,null,null,"出場校情報",null,"役員希望","◆参加者一覧◆"]
[]
[]
[]
[null,null,null,null,null,null,null,null,null,null,null,null,null,null,null,null,null,null,null,null,null,null,null,null,null,null,null,null,null,null,null,null,null,null,null,null,null,null,null,null,null,null,null,null,null,null,null,null,null,null,null,null,null,null,null,null,null,null,null,null,null,null,null,null,null,null,null,null,null,"斜里中","斜里町立斜里中学校","一任","男","中1",null,"種目選択名称","事務局シートへ",null,null,"種目選択名称","事務局シートへ",null,null,"リレー選択",null,null,"種目抽出",null,null,"R抽出",null,null,"氏名","種目数カウント"]
["◆出場校情報◆",null,null,null,null,null,null,null,null,"◆競技役員希望◆",null,null,null,null,null,null,"◆参加料◆",null,null,null,null,null,null,null,null,null,null,null,null,null,null,null,null,null,null,null,null,null,null,null,null,null,null,null,null,"◆参加人数◆",null,null,null,null,null,null,null,null,null,null,null,null,null,null,null,null,null,null,null,null,null,null,null,"斜里知床ウトロ","斜里町立知床ウトロ学校","技術総務","女","中2",2002]
[null,null,null,null,null,null,null,null,null,null,null,null,null,null,null,null,null,null,null,null,null,null,null,null,null,null,null,null,null,null,null,null,null,null,null,null,null,null,null,null,null,null,null,null,null,null,null,null,null,null,null,null,null,null,null,null,null,null,null,null,null,null,null,null,null,null,null,null,null,"清里中","清里町立清里中学校","番組編成 ",null,"中3",2003]
["学校名",null,null,"北見常呂中",null,null,null,null,null,"審判員氏名","希望役職①","希望役職②",null,null,null,null,"1種目",null,null,null,1000,null,null,null,null,{"$f":"COUNTIF($CP$8:$CP$52,1)","v":0},null,null,"合計",null,{"$f":"U8*Z8+U9*Z9+U10*Z10","v":0},null,null,null,null,null,null,null,null,null,null,null,null,null,null,"中1",null,null,{"$f":"COUNTIF($G$14:$G$58,AT8)","v":0},null,null,null,null,"男子",null,null,{"$f":"COUNTIF($B$14:$B$58,\"男\")","v":1},null,null,null,null,null,null,null,null,null,null,null,null,"大空女満別中","大空町立女満別中学校","記録情報処理",null,null,2004,"1年100m","男子1年100m",{"$f":"\"男\"&BX8","v":"男1年100m"},"ア","1年100m","女子1年100m",{"$f":"\"女\"&CB8","v":"女1年100m"},"A","男子",null,1,{"$f":"B14&H14","v":"女"},{"$f":"COUNTIF($CI$8:CI8,CI8)","v":1},{"$f":"CJ8&CI8","v":"1女"},{"$f":"IF(M14=\"男子\",\"A\",IF(M14=\"女子\",\"B\",\"C\"))","v":"C"},{"$f":"COUNTIF(CL$8:$CL8,CL8)","v":1},{"$f":"CM8&CL8","v":"1C"},{"$f":"SUBSTITUTE(D14,\"　\",\"\")","v":""},{"$f":"IF(H14=\"\",0,1)+IF(K14=\"\",0,1)","v":0}]
["記載責任者（監督）\n下段には、携帯電話番号",null,null,null,null,null,null,null,null,null,null,null,null,null,null,null,"2種目",null,null,null,1600,null,null,null,null,{"$f":"COUNTIF($CP$8:$CP$52,2)","v":0},null,null,null,null,null,null,null,null,null,null,null,null,null,null,null,null,null,null,null,"中2",null,null,{"$f":"COUNTIF($G$14:$G$58,AT9)","v":0},null,null,null,null,"女子",null,null,{"$f":"COUNTIF($B$14:$B$58,\"女\")","v":1},null,null,null,null,null,null,null,null,null,null,null,null,"大空東藻琴中","大空町立東藻琴中学校","アナウンサー",null,null,2005,"1年1500m","男子1年1500m",{"$f":"\"男\"&BX9","v":"男1年1500m"},"イ","1年80mH","女子1年80mH",{"$f":"\"女\"&CB9","v":"女1年80mH"},"B","女子",null,2,"男",{"$f":"COUNTIF($CI$8:CI9,CI9)","v":1},{"$f":"CJ9&CI9","v":"1男"},{"$f":"IF(M15=\"男子\",\"A\",IF(M15=\"女子\",\"B\",\"C\"))","v":"C"},{"$f":"COUNTIF(CL$8:$CL9,CL9)","v":2},{"$f":"CM9&CL9","v":"2C"},{"$f":"SUBSTITUTE(D15,\"　\",\"\")","v":""},{"$f":"IF(H15=\"\",0,1)+IF(K15=\"\",0,1)","v":0}]
[null,null,null,null,null,null,null,null,null,null,null,null,null,null,null,null,"リレー",null,null,null,2000,null,null,null,null,{"$f":"IF(COUNTIF($M$14:$M$58,\"男子\")>0,1,0)+IF(COUNTIF($M$14:$M$58,\"女子\")>0,1,0)","v":0},null,null,null,null,null,null,null,null,null,null,null,null,null,null,null,null,null,null,null,"中3",null,null,0,null,null,null,null,"計",null,null,{"$f":"BE8+BE9","v":2},null,null,null,null,null,null,null,null,null,null,null,null,"美幌中","美幌町立美幌中学校","風 力 計 測 ",null,null,null,"1年100mH","男子1年100mH","男1年100mH","ウ","1年1000m","女子1年1000m","女1年1000m","C",null,null,3,"",{"$f":"COUNTIF($CI$8:CI10,CI10)","v":1},"1","C",{"$f":"COUNTIF(CL$8:$CL10,CL10)","v":3},"3C","",0]
{"$rows_left_out":88}
{"sheet":"事務局シート","index":3,"n_rows":46,"n_cols":13,"rows_kept":46,"cut":false,"hidden":false,"merged":[]}
[null,"学校名","性","NC","氏名","生年","ﾌﾘｶﾞﾅ","学年","種目","ベスト","種目","ベスト","R"]
[1,{"$f":"IF(C2=\"\",\"\",申込書!$D$8)","v":"北見常呂中"},{"$f":"IF(申込書!B14=\"\",\"\",申込書!B14)","v":"女"},{"$f":"IF(申込書!C14=\"\",\"\",申込書!C14)","v":""},{"$f":"IF(申込書!D14=\"\",\"\",申込書!D14)","v":""},{"$f":"RIGHT(申込書!E14,2)","v":""},{"$f":"申込書!F14","v":""},{"$f":"RIGHT(申込書!G14,1)","v":""},{"$f":"IF(ISERROR(VLOOKUP(申込書!B14&申込書!H14,申込書!$BZ$29:$CB$68,3,FALSE)),\"\",VLOOKUP(申込書!B14&申込書!H14,申込書!$BZ$29:$CB$68,3,FALSE))","v":0},{"$f":"IF(申込書!J14=\"\",\"\",申込書!J14)","v":""},{"$f":"IF(ISERROR(VLOOKUP(申込書!B14&申込書!K14,申込書!$BZ$29:$CB$68,3,FALSE)),\"\",VLOOKUP(申込書!B14&申込書!K14,申込書!$BZ$29:$CB$68,3,FALSE))","v":0},{"$f":"IF(申込書!L14=\"\",\"\",申込書!L14)","v":""},{"$f":"IF(申込書!M14=\"\",\"\",申込書!M14)","v":""}]
[2,{"$f":"IF(C3=\"\",\"\",申込書!$D$8)","v":"北見常呂中"},{"$f":"IF(申込書!B15=\"\",\"\",申込書!B15)","v":"男"},{"$f":"IF(申込書!C15=\"\",\"\",申込書!C15)","v":""},{"$f":"IF(申込書!D15=\"\",\"\",申込書!D15)","v":""},{"$f":"RIGHT(申込書!E15,2)","v":""},{"$f":"申込書!F15","v":""},{"$f":"RIGHT(申込書!G15,1)","v":""},{"$f":"IF(ISERROR(VLOOKUP(申込書!B15&申込書!H15,申込書!$BZ$29:$CB$68,3,FALSE)),\"\",VLOOKUP(申込書!B15&申込書!H15,申込書!$BZ$29:$CB$68,3,FALSE))","v":0},{"$f":"IF(申込書!J15=\"\",\"\",申込書!J15)","v":""},{"$f":"IF(ISERROR(VLOOKUP(申込書!B15&申込書!K15,申込書!$BZ$29:$CB$68,3,FALSE)),\"\",VLOOKUP(申込書!B15&申込書!K15,申込書!$BZ$29:$CB$68,3,FALSE))","v":0},{"$f":"IF(申込書!L15=\"\",\"\",申込書!L15)","v":""},{"$f":"IF(申込書!M15=\"\",\"\",申込書!M15)","v":""}]
[3,{"$f":"IF(C4=\"\",\"\",申込書!$D$8)","v":""},{"$f":"IF(申込書!B16=\"\",\"\",申込書!B16)","v":""},{"$f":"IF(申込書!C16=\"\",\"\",申込書!C16)","v":""},{"$f":"IF(申込書!D16=\"\",\"\",申込書!D16)","v":""},{"$f":"RIGHT(申込書!E16,2)","v":""},{"$f":"申込書!F16","v":""},{"$f":"RIGHT(申込書!G16,1)","v":""},{"$f":"IF(ISERROR(VLOOKUP(申込書!B16&申込書!H16,申込書!$BZ$29:$CB$68,3,FALSE)),\"\",VLOOKUP(申込書!B16&申込書!H16,申込書!$BZ$29:$CB$68,3,FALSE))","v":""},{"$f":"IF(申込書!J16=\"\",\"\",申込書!J16)","v":""},{"$f":"IF(ISERROR(VLOOKUP(申込書!B16&申込書!K16,申込書!$BZ$29:$CB$68,3,FALSE)),\"\",VLOOKUP(申込書!B16&申込書!K16,申込書!$BZ$29:$CB$68,3,FALSE))","v":""},{"$f":"IF(申込書!L16=\"\",\"\",申込書!L16)","v":""},{"$f":"IF(申込書!M16=\"\",\"\",申込書!M16)","v":""}]
[4,{"$f":"IF(C5=\"\",\"\",申込書!$D$8)","v":""},{"$f":"IF(申込書!B17=\"\",\"\",申込書!B17)","v":""},{"$f":"IF(申込書!C17=\"\",\"\",申込書!C17)","v":""},{"$f":"IF(申込書!D17=\"\",\"\",申込書!D17)","v":""},{"$f":"RIGHT(申込書!E17,2)","v":""},{"$f":"申込書!F17","v":""},{"$f":"RIGHT(申込書!G17,1)","v":""},{"$f":"IF(ISERROR(VLOOKUP(申込書!B17&申込書!H17,申込書!$BZ$29:$CB$68,3,FALSE)),\"\",VLOOKUP(申込書!B17&申込書!H17,申込書!$BZ$29:$CB$68,3,FALSE))","v":""},{"$f":"IF(申込書!J17=\"\",\"\",申込書!J17)","v":""},{"$f":"IF(ISERROR(VLOOKUP(申込書!B17&申込書!K17,申込書!$BZ$29:$CB$68,3,FALSE)),\"\",VLOOKUP(申込書!B17&申込書!K17,申込書!$BZ$29:$CB$68,3,FALSE))","v":""},{"$f":"IF(申込書!L17=\"\",\"\",申込書!L17)","v":""},{"$f":"IF(申込書!M17=\"\",\"\",申込書!M17)","v":""}]
[5,{"$f":"IF(C6=\"\",\"\",申込書!$D$8)","v":""},{"$f":"IF(申込書!B18=\"\",\"\",申込書!B18)","v":""},{"$f":"IF(申込書!C18=\"\",\"\",申込書!C18)","v":""},{"$f":"IF(申込書!D18=\"\",\"\",申込書!D18)","v":""},{"$f":"RIGHT(申込書!E18,2)","v":""},{"$f":"申込書!F18","v":""},{"$f":"RIGHT(申込書!G18,1)","v":""},{"$f":"IF(ISERROR(VLOOKUP(申込書!B18&申込書!H18,申込書!$BZ$29:$CB$68,3,FALSE)),\"\",VLOOKUP(申込書!B18&申込書!H18,申込書!$BZ$29:$CB$68,3,FALSE))","v":""},{"$f":"IF(申込書!J18=\"\",\"\",申込書!J18)","v":""},{"$f":"IF(ISERROR(VLOOKUP(申込書!B18&申込書!K18,申込書!$BZ$29:$CB$68,3,FALSE)),\"\",VLOOKUP(申込書!B18&申込書!K18,申込書!$BZ$29:$CB$68,3,FALSE))","v":""},{"$f":"IF(申込書!L18=\"\",\"\",申込書!L18)","v":""},{"$f":"IF(申込書!M18=\"\",\"\",申込書!M18)","v":""}]
[6,{"$f":"IF(C7=\"\",\"\",申込書!$D$8)","v":""},{"$f":"IF(申込書!B19=\"\",\"\",申込書!B19)","v":""},{"$f":"IF(申込書!C19=\"\",\"\",申込書!C19)","v":""},{"$f":"IF(申込書!D19=\"\",\"\",申込書!D19)","v":""},{"$f":"RIGHT(申込書!E19,2)","v":""},{"$f":"申込書!F19","v":""},{"$f":"RIGHT(申込書!G19,1)","v":""},{"$f":"IF(ISERROR(VLOOKUP(申込書!B19&申込書!H19,申込書!$BZ$29:$CB$68,3,FALSE)),\"\",VLOOKUP(申込書!B19&申込書!H19,申込書!$BZ$29:$CB$68,3,FALSE))","v":""},{"$f":"IF(申込書!J19=\"\",\"\",申込書!J19)","v":""},{"$f":"IF(ISERROR(VLOOKUP(申込書!B19&申込書!K19,申込書!$BZ$29:$CB$68,3,FALSE)),\"\",VLOOKUP(申込書!B19&申込書!K19,申込書!$BZ$29:$CB$68,3,FALSE))","v":""},{"$f":"IF(申込書!L19=\"\",\"\",申込書!L19)","v":""},{"$f":"IF(申込書!M19=\"\",\"\",申込書!M19)","v":""}]
[7,{"$f":"IF(C8=\"\",\"\",申込書!$D$8)","v":""},{"$f":"IF(申込書!B20=\"\",\"\",申込書!B20)","v":""},{"$f":"IF(申込書!C20=\"\",\"\",申込書!C20)","v":""},{"$f":"IF(申込書!D20=\"\",\"\",申込書!D20)","v":""},{"$f":"RIGHT(申込書!E20,2)","v":""},{"$f":"申込書!F20","v":""},{"$f":"RIGHT(申込書!G20,1)","v":""},{"$f":"IF(ISERROR(VLOOKUP(申込書!B20&申込書!H20,申込書!$BZ$29:$CB$68,3,FALSE)),\"\",VLOOKUP(申込書!B20&申込書!H20,申込書!$BZ$29:$CB$68,3,FALSE))","v":""},{"$f":"IF(申込書!J20=\"\",\"\",申込書!J20)","v":""},{"$f":"IF(ISERROR(VLOOKUP(申込書!B20&申込書!K20,申込書!$BZ$29:$CB$68,3,FALSE)),\"\",VLOOKUP(申込書!B20&申込書!K20,申込書!$BZ$29:$CB$68,3,FALSE))","v":""},{"$f":"IF(申込書!L20=\"\",\"\",申込書!L20)","v":""},{"$f":"IF(申込書!M20=\"\",\"\",申込書!M20)","v":""}]
[8,{"$f":"IF(C9=\"\",\"\",申込書!$D$8)","v":""},{"$f":"IF(申込書!B21=\"\",\"\",申込書!B21)","v":""},{"$f":"IF(申込書!C21=\"\",\"\",申込書!C21)","v":""},{"$f":"IF(申込書!D21=\"\",\"\",申込書!D21)","v":""},{"$f":"RIGHT(申込書!E21,2)","v":""},{"$f":"申込書!F21","v":""},{"$f":"RIGHT(申込書!G21,1)","v":""},{"$f":"IF(ISERROR(VLOOKUP(申込書!B21&申込書!H21,申込書!$BZ$29:$CB$68,3,FALSE)),\"\",VLOOKUP(申込書!B21&申込書!H21,申込書!$BZ$29:$CB$68,3,FALSE))","v":""},{"$f":"IF(申込書!J21=\"\",\"\",申込書!J21)","v":""},{"$f":"IF(ISERROR(VLOOKUP(申込書!B21&申込書!K21,申込書!$BZ$29:$CB$68,3,FALSE)),\"\",VLOOKUP(申込書!B21&申込書!K21,申込書!$BZ$29:$CB$68,3,FALSE))","v":""},{"$f":"IF(申込書!L21=\"\",\"\",申込書!L21)","v":""},{"$f":"IF(申込書!M21=\"\",\"\",申込書!M21)","v":""}]
[9,{"$f":"IF(C10=\"\",\"\",申込書!$D$8)","v":""},{"$f":"IF(申込書!B22=\"\",\"\",申込書!B22)","v":""},{"$f":"IF(申込書!C22=\"\",\"\",申込書!C22)","v":""},{"$f":"IF(申込書!D22=\"\",\"\",申込書!D22)","v":""},{"$f":"RIGHT(申込書!E22,2)","v":""},{"$f":"申込書!F22","v":""},{"$f":"RIGHT(申込書!G22,1)","v":""},{"$f":"IF(ISERROR(VLOOKUP(申込書!B22&申込書!H22,申込書!$BZ$29:$CB$68,3,FALSE)),\"\",VLOOKUP(申込書!B22&申込書!H22,申込書!$BZ$29:$CB$68,3,FALSE))","v":""},{"$f":"IF(申込書!J22=\"\",\"\",申込書!J22)","v":""},{"$f":"IF(ISERROR(VLOOKUP(申込書!B22&申込書!K22,申込書!$BZ$29:$CB$68,3,FALSE)),\"\",VLOOKUP(申込書!B22&申込書!K22,申込書!$BZ$29:$CB$68,3,FALSE))","v":""},{"$f":"IF(申込書!L22=\"\",\"\",申込書!L22)","v":""},{"$f":"IF(申込書!M22=\"\",\"\",申込書!M22)","v":""}]
{"$rows_left_out":37}
{"sheet":"ﾅﾝﾊﾞｰｶｰﾄﾞ","index":4,"n_rows":30,"n_cols":22,"rows_kept":30,"cut":false,"hidden":true,"merged":[[34,7,34,14],[35,7,35,14],[36,7,36,14],[28,1,28,21],[29,2,29,21],[30,2,30,21],[31,7,31,14],[32,7,32,14],[33,7,33,14],[8,4,8,6],[8,11,8,13],[8,18,8,20],[0,0,0,21],[1,17,1,21],[2,1,2,21],[4,14,5,21],[6,1,6,21]]}
["オホーツク中体連陸上競技大会ナンバーカードについて"]
[null,null,null,null,null,null,null,null,null,null,null,null,null,null,null,null,null,"Ｈ29．04．22より"]
["１","プログラムなどの学校標記も下記の通りとします。（管内レベル）"]
[]
["２","学校番号は、専門委員会の事務作業上の都合で割り振りました。",null,null,null,null,null,null,null,null,null,null,null,null,"男子：黒　　女子：赤　　同一番号です"]
[]
["３","ナンバーカード割り振り一覧"]
[null,null,null,null,1]
[null,"番号","学校名","数","新番号",null,null,"旧番号","番号","学校名","数","新番号",null,null,"旧番号","番号","学校名","数","新番号",null,null,"番　　号"]
[null,1,"斜里中",30,1,"～",30,"１～　３０",19,"湧別中",20,241,"～",260,"２９１～３００",37,"北見仁頃中",null,null,null,null,"６２１～６４０"]
{"$rows_left_out":20}